{"text_format":"1","workbook":"xlsx","n_sheets":12,"sheets":["Hoofdmenu","Toelichting","NAW_gegevens","Voorblad","Kostenverzamelstaat","Specifieke informatie A","Specifieke informatie B","Specifieke informatie C","Contractinformatie","Controleoverzicht","Blad1","Parameters"],"not_rendered":{"charts":0,"images":1,"macros":1,"external_links":0,"defined_names":442,"comments":1,"pivot_tables":0},"unopened":[],"bounds":{"document_bytes":16777216,"sheet_cells":100000,"rows_first":2000,"rows_last":500,"rows_between":2000,"halvings":0,"cell_chars":16384,"cell_head_chars":4096},"cells_cut":0,"cells_raw":0,"read":"whole","date_system":"1900"}

{"sheet":"Hoofdmenu","index":0,"n_rows":3,"n_cols":2,"rows_kept":3,"cut":false,"hidden":false,"merged":[[0,0,0,1],[1,0,1,1]]}
["HOOFDMENU"]
[{"$f":"CONCATENATE(\"JAARSTAAT ZVW \",jaar_id)","v":"JAARSTAAT ZVW 2023"}]
["Navigatie","Afdrukken"]

{"sheet":"Toelichting","index":1,"n_rows":3,"n_cols":2,"rows_kept":3,"cut":false,"hidden":false,"merged":[]}
[]
[]
[null,{"$f":"CONCATENATE(\" JAARSTAAT ZVW \",jaar_id,\" (VERSIE: \",document_id,\")\")","v":" JAARSTAAT ZVW 2023 (VERSIE: JS2023ZVW.A)"}]

{"sheet":"NAW_gegevens","index":2,"n_rows":37,"n_cols":5,"rows_kept":37,"cut":false,"hidden":false,"merged":[[2,0,2,1],[3,0,3,1]]}
[]
[]
["NAW-GEGEVENS"]
[{"$f":"CONCATENATE(\"JAARSTAAT ZVW 2023\")","v":"JAARSTAAT ZVW 2023"}]
[" Selecteer uw nummer:>","0000 KIES UW UZOVI-NUMMER"]
[" Uzovi-nummer:",{"$f":"MID(keuze_uzovi_nummer,1,4)","v":"0000"}]
[" Verzekeraar:"]
[" Plaats:"]
[" Contactpersoon:"]
[" Telefoonnummer:"]
[" E-mail:"]
[]
[]
["Let op dat u het goede UZOVI-nummer invult, zie onderstaand overzicht:"]
[]
{"$rows_left_out":23}
{"sheet":"Voorblad","index":3,"n_rows":36,"n_cols":4,"rows_kept":36,"cut":false,"hidden":false,"merged":[[13,3,14,11],[15,3,16,11],[19,3,20,11],[21,3,22,11]]}
[null,null,"VOORBLAD"]
[]
[]
[]
[]
["Pagina 1"]
[]
[]
[]
[]
[]
[]
[]
[]
[]
{"$rows_left_out":22}
{"sheet":"Kostenverzamelstaat","index":4,"n_rows":159,"n_cols":16,"rows_kept":159,"cut":false,"hidden":false,"merged":[[10,12,11,12],[12,12,13,12],[64,3,64,6],[65,3,65,6],[10,3,13,6],[10,8,11,9],[10,10,11,11],[12,7,13,7],[12,8,13,8],[12,9,13,9],[12,10,13,10],[12,11,13,11],[19,3,19,6],[20,3,20,6],[21,3,21,6],[22,3,22,6],[110,3,110,6],[67,3,67,6],[68,3,68,6],[71,3,71,6],[73,3,73,6],[74,3,74,6],[75,3,75,6],[76,3,76,6],[94,3,94,4],[47,3,47,4],[46,3,46,4],[54,3,57,6],[62,3,62,6],[54,8,55,9],[47,9,47,12],[54,10,55,11],[54,12,55,12],[56,7,57,7],[56,8,57,8],[56,9,57,9],[56,10,57,10],[56,11,57,11],[56,12,57,12],[151,12,152,12],[153,3,153,6],[101,3,104,6],[101,8,102,9],[101,10,102,11],[101,12,102,12],[103,7,104,7],[103,8,104,8],[103,9,104,9],[103,10,104,10],[103,11,104,11],[103,12,104,12],[111,3,111,6],[112,3,112,6],[116,3,116,7],[149,3,149,11],[154,3,154,6],[158,3,158,4],[151,9,152,9],[151,10,152,10],[151,11,152,11],[151,3,152,6],[151,7,152,7],[151,8,152,8],[146,3,146,11],[146,12,147,12],[147,3,147,11],[148,3,148,11],[66,3,66,6],[79,3,79,6],[80,3,80,6],[82,3,82,6],[86,3,86,6],[77,3,77,6],[78,3,78,6],[87,3,87,6],[88,3,88,6],[89,3,89,6],[90,3,90,6],[94,9,94,12]]}
[null,null,"INVULSPECIFICATIES SPECIFIEKE INFORMATIE A"]
[]
[]
[]
[]
["Pagina 1",null,null,{"$f":"CONCATENATE(\"JAARSTAAT ZVW \", jaar_id)","v":"JAARSTAAT ZVW 2023"}]
[null,null,null,"SPECIFIEKE INFORMATIE A: KOSTENVERZAMELSTAAT"]
[null,null,null,{"$f":"IF(naw_uzovi_zorgverzekeraar<>\"0000\",CONCATENATE(UPPER(naw_naam_zorgverzekeraar),\", \",UPPER(naw_plaats_zorgverzekeraar)),\"\")","v":""},null,null,null,null,null,null,null,null,{"$f":"CONCATENATE(\"UZOVI: \",naw_uzovi_zorgverzekeraar)","v":"UZOVI: 0000"}]
[null,null,null,"SPECIFICATIES INFORMATIE RISICOVEREVENING"]
[null,null,null,{"$f":"$D$7","v":"SPECIFIEKE INFORMATIE A: KOSTENVERZAMELSTAAT"}]
[null,null,null," KOSTENRUBRIEK",null,null,null,null,{"$f":"CONCATENATE(\"LASTEN \",jaar_id)","v":"LASTEN 2023"},null,{"$f":"CONCATENATE(\"LASTEN \",jaar_id-1,)","v":"LASTEN 2022"},null,{"$f":"CONCATENATE(\"LASTEN \",jaar_id-2,\"^ \nEN OUDER\")","v":"LASTEN 2021^ \nEN OUDER"}]
[]
[null,null,null,null,null,null,null,"Code",{"$f":"CONCATENATE(\"LASTEN \",jaar_id,\" inclusief balanspost \")","v":"LASTEN 2023 inclusief balanspost "},{"$f":"CONCATENATE(\"Ontvangen en geaccepteerde declaraties m.b.t. \",jaar_id)","v":"Ontvangen en geaccepteerde declaraties m.b.t. 2023"},{"$f":"CONCATENATE(\"LASTEN \",jaar_id-1,\" inclusief balanspost \")","v":"LASTEN 2022 inclusief balanspost "},{"$f":"CONCATENATE(\"Ontvangen en geaccepteerde declaraties m.b.t. \",jaar_id-1)","v":"Ontvangen en geaccepteerde declaraties m.b.t. 2022"},{"$f":"CONCATENATE(\"Ontvangen en geaccepteerde declaraties m.b.t. \",jaar_id-2, \" en ouder\")","v":"Ontvangen en geaccepteerde declaraties m.b.t. 2021 en ouder"}]
[null,null,null,null,null,null,null,null,null,"Ontvangen en geaccepteerde declaraties mbt jaar T",null,"Ontvangen en geaccepteerde declaraties mbt jaar T","Ontvangen en geaccepteerde declaraties mbt jaar T-1"]
[null,null,null," 01  HUISARTSENZORG en MDZ"]
{"$rows_left_out":145}
{"sheet":"Specifieke informatie A","index":5,"n_rows":101,"n_cols":20,"rows_kept":101,"cut":false,"hidden":false,"merged":[[73,8,73,9],[73,10,73,11],[73,12,73,13],[73,14,73,15],[73,16,73,17],[73,18,73,19],[96,8,96,9],[96,10,96,11],[96,12,96,13],[96,14,96,15],[96,16,96,17],[96,18,96,19],[65,3,65,4],[72,3,73,7],[93,3,93,7],[95,3,95,7],[96,3,97,7],[100,3,100,4],[85,3,85,7],[79,3,79,7],[92,3,92,7],[94,3,94,7],[74,3,75,7],[80,3,80,7],[81,3,81,7],[82,3,82,7],[76,3,76,7],[77,3,77,7],[86,3,86,7],[83,3,83,7],[84,3,84,7],[78,3,78,7],[98,3,98,7],[33,11,34,11],[35,3,35,9],[19,10,20,10],[19,11,20,11],[21,3,21,9],[22,3,22,9],[24,10,25,10],[24,3,25,9],[24,11,25,11],[11,11,12,11],[13,3,13,9],[11,10,12,10],[11,3,12,9],[14,3,14,9],[54,11,55,11],[56,3,58,4],[56,5,56,9],[57,5,57,9],[58,5,58,9],[54,3,55,9],[54,10,55,10],[48,11,49,11],[48,3,49,9],[48,10,49,10],[41,3,41,4],[28,3,29,9],[28,10,29,10],[28,11,29,11],[30,3,30,9],[37,10,38,10],[37,11,38,11],[39,3,39,9],[33,10,34,10],[59,3,59,9],[62,3,62,9],[63,3,63,9],[15,3,15,9],[26,3,26,9],[16,3,16,9],[50,3,50,9],[51,3,51,9],[52,3,52,9],[19,3,20,9],[33,3,34,9],[37,3,38,9],[31,3,31,9],[97,10,97,11],[89,3,89,7],[91,3,91,7],[90,3,90,7],[87,3,87,7],[88,3,88,7],[74,11,75,11],[74,8,75,8],[95,8,95,9],[95,10,95,11],[74,9,75,9],[74,10,75,10],[97,8,97,9],[97,16,97,17],[97,18,97,19],[74,16,75,16],[74,17,75,17],[74,18,75,18],[74,19,75,19],[97,12,97,13],[95,16,95,17],[95,18,95,19],[74,14,75,14],[74,15,75,15],[97,14,97,15],[95,12,95,13],[95,14,95,15],[74,12,75,12],[74,13,75,13]]}
[null,null,"INVULSPECIFICATIES SPECIFIEKE INFORMATIE A"]
[]
[]
[]
[]
["Pagina 1",null,null,{"$f":"CONCATENATE(\"JAARSTAAT ZVW \", jaar_id)","v":"JAARSTAAT ZVW 2023"}]
[null,null,null,"SPECIFIEKE INFORMATIE A  2023: DETAILINFORMATIE RVE"]
[null,null,null,{"$f":"IF(naw_uzovi_zorgverzekeraar<>\"0000\",CONCATENATE(UPPER(naw_naam_zorgverzekeraar),\", \",UPPER(naw_plaats_zorgverzekeraar)),\"\")","v":""},null,null,null,null,null,null,null,{"$f":"CONCATENATE(\"UZOVI: \",naw_uzovi_zorgverzekeraar)","v":"UZOVI: 0000"}]
[]
[null,null,null,"SPECIFICATIES INFORMATIE RISICOVEREVENING"]
[null,null,null,"KOSTEN NAAR DEELBIJDRAGE"]
[null,null,null," KOSTEN NAAR DEELBIJDRAGE",null,null,null,null,null,null,"Lasten 2023 inclusief balanspost","Ontvangen en geaccepteerde declaraties m.b.t. 2021 en ouder"]
[]
[null,null,null," Variabele zorgkosten"]
[null,null,null," Vaste zorgkosten "]
{"$rows_left_out":87}
{"sheet":"Specifieke informatie B","index":6,"n_rows":101,"n_cols":14,"rows_kept":101,"cut":false,"hidden":false,"merged":[[92,3,92,7],[79,3,79,6],[80,3,80,6],[81,3,81,6],[82,3,82,6],[89,3,89,6],[90,3,90,7],[84,3,84,7],[85,3,85,7],[86,3,86,6],[87,3,87,7],[88,3,88,7],[100,6,100,11],[95,3,95,7],[100,3,100,4],[97,3,97,7],[97,8,98,8],[97,9,98,9],[97,10,98,10],[98,3,98,6],[99,3,99,6],[78,3,78,7],[63,3,63,6],[64,3,64,6],[65,3,65,6],[66,3,66,4],[75,3,75,7],[76,3,76,6],[77,3,77,7],[73,7,74,7],[73,8,74,8],[73,9,74,9],[73,10,74,10],[62,3,62,7],[49,3,49,6],[52,3,52,6],[53,3,53,6],[54,3,54,6],[55,3,55,6],[56,3,56,6],[57,3,57,6],[58,3,58,7],[59,3,59,7],[60,3,60,6],[61,3,61,7],[66,6,66,11],[48,3,48,6],[42,7,43,7],[42,8,43,8],[42,10,43,10],[44,3,44,7],[45,3,45,6],[46,3,46,6],[47,3,47,6],[42,9,43,9],[20,3,20,7],[21,3,21,6],[22,3,22,6],[24,3,24,6],[25,3,25,6],[31,3,31,7],[32,3,32,6],[33,3,33,7],[35,3,35,4],[23,3,23,7],[26,3,26,7],[27,3,27,7],[28,3,28,6],[29,3,29,6],[30,3,30,7],[35,5,35,11],[10,7,11,7],[10,8,11,8],[10,9,11,9],[10,10,11,10],[17,3,17,6],[18,3,18,6],[19,3,19,7],[12,3,12,7],[13,3,13,6],[14,3,14,6],[15,3,15,6],[16,3,16,6]]}
[null,null,"INVULSPECIFICATIES SPECIFIEKE INFORMATIE B"]
[]
[]
[]
[]
["Pagina 1",null,null,{"$f":"CONCATENATE(\"JAARSTAAT ZVW \", jaar_id)","v":"JAARSTAAT ZVW 2023"}]
[null,null,null,"SPECIFIEKE INFORMATIE B: KOSTENVERZAMELSTAAT CATASTROFESCHADELAST"]
[null,null,null,{"$f":"IF(naw_uzovi_zorgverzekeraar<>\"0000\",CONCATENATE(UPPER(naw_naam_zorgverzekeraar),\", \",UPPER(naw_plaats_zorgverzekeraar)),\"\")","v":""},null,null,null,null,null,null,{"$f":"CONCATENATE(\"UZOVI: \",naw_uzovi_zorgverzekeraar)","v":"UZOVI: 0000"}]
[null,null,null,"SPECIFICATIES INFORMATIE RISICOVEREVENING"]
[null,null,null,"KOSTENVERZAMELSTAAT CATASTROFESCHADELAST"]
[null,null,null,null,null,null,null,"\ncode","Ontvangen en geaccepteerde declaraties m.b.t. 2021","Ontvangen en geaccepteerde declaraties m.b.t. 2020","TOTAAL ontvangen en geaccepteerde declaraties 2020 en 2021"]
[null,null,null," KOSTENRUBRIEK"]
[null,null,null," 01  HUISARTSENZORG en MDZ"]
[null,null,null," Avond-, nacht- en weekenddiensten",null,null,null,"504   ",null,null,{"$f":"I14+J14","v":0},null,null,""]
[null,null,null," Consulttarieven",null,null,null,"506   ",null,null,0,null,null,""]
{"$rows_left_out":87}
{"sheet":"Specifieke informatie C","index":7,"n_rows":126,"n_cols":12,"rows_kept":126,"cut":false,"hidden":false,"merged":[[22,3,22,6],[18,3,20,6],[18,7,18,8],[18,9,18,10],[19,7,20,7],[19,8,20,8],[19,9,20,9],[19,10,20,10],[19,11,20,11],[21,3,21,6],[125,3,125,4],[116,11,117,11],[118,3,119,4],[118,5,118,9],[119,5,119,9],[120,3,120,9],[121,3,121,9],[35,3,37,6],[35,7,35,8],[35,9,35,10],[36,7,37,7],[36,8,37,8],[36,9,37,9],[36,10,37,10],[36,11,37,11],[38,3,38,6],[39,3,39,6],[40,3,40,6],[41,3,41,6],[42,3,42,6],[49,3,51,6],[49,7,49,8],[49,9,49,10],[50,7,51,7],[50,8,51,8],[102,11,103,11],[104,3,104,9],[105,3,105,9],[106,3,106,9],[109,3,110,9],[109,10,110,10],[109,11,110,11],[111,3,112,4],[94,3,94,9],[95,3,95,9],[96,3,96,9],[97,3,97,9],[98,3,98,9],[100,3,100,9],[102,3,103,9],[102,10,103,10],[60,9,60,10],[60,3,62,4],[60,7,60,8],[99,3,99,9],[113,3,113,9],[69,5,69,6],[68,3,68,6],[69,3,69,4],[90,3,91,9],[84,3,84,4],[90,10,91,10],[28,7,28,11],[63,3,63,4],[61,10,62,10],[31,3,31,6],[29,3,29,6],[50,9,51,9],[50,10,51,10],[50,11,51,11],[52,3,52,6],[53,3,53,6],[54,3,54,6],[55,3,55,6],[56,3,56,6],[60,5,62,6],[61,8,62,8],[92,3,92,9],[93,3,93,9],[114,3,114,9],[116,3,117,9],[116,10,117,10],[57,3,57,6],[11,11,12,11],[28,5,28,6],[33,3,33,6],[30,3,30,6],[11,10,12,10],[11,7,12,7],[26,8,27,8],[26,11,27,11],[25,9,25,10],[25,5,27,6],[13,3,13,6],[25,3,27,4],[26,9,27,9],[14,3,14,6],[15,3,15,6],[26,7,27,7],[61,9,62,9],[112,5,112,9],[90,11,91,11],[61,7,62,7],[10,7,10,8],[10,3,12,6],[11,8,12,8],[11,9,12,9],[10,9,10,10],[111,5,111,9],[32,3,32,6],[28,3,28,4],[25,7,25,8],[26,10,27,10],[43,3,43,4],[63,5,63,6],[64,3,64,6],[65,3,65,6],[73,3,73,6],[74,3,74,6],[63,7,63,11],[72,3,72,6],[66,3,66,6],[67,3,67,6],[71,3,71,6],[69,7,69,11],[61,11,62,11],[70,3,70,6]]}
[null,null,"INVULSPECIFICATIES SPECIFIEKE INFORMATIE C"]
[]
[]
[]
[]
["Pagina 1",null,null,{"$f":"CONCATENATE(\"JAARSTAAT ZVW \", jaar_id)","v":"JAARSTAAT ZVW 2023"}]
[null,null,null,"SPECIFIEKE INFORMATIE C: SPECIFICATIES VAN KOSTEN EN PRODUCTIE"]
[null,null,null,{"$f":"IF(naw_uzovi_zorgverzekeraar<>\"0000\",CONCATENATE(UPPER(naw_naam_zorgverzekeraar),\", \",UPPER(naw_plaats_zorgverzekeraar)),\"\")","v":""},null,null,null,null,null,null,null,{"$f":"CONCATENATE(\"UZOVI: \",naw_uzovi_zorgverzekeraar)","v":"UZOVI: 0000"}]
[null,null,null,"SPECIFICATIES VAN KOSTEN EN PRODUCTIE"]
[null,null,null,"RUBRIEK 06 MEDISCH SPECIALISTISCHE ZORG"]
[null,null,null," CODE 610 - OVERIGE KOSTEN \n ZIEKENHUISZORG EN CURATIEVE ZORG",null,null,null,{"$f":"CONCATENATE(\"LASTEN \",jaar_id)","v":"LASTEN 2023"},null,{"$f":"CONCATENATE(\"LASTEN \",jaar_id-1)","v":"LASTEN 2022"},null,{"$f":"CONCATENATE(\"LASTEN \",jaar_id-2,\" \",\"en ouder\")","v":"LASTEN 2021 en ouder"}]
[null,null,null,null,null,null,null,{"$f":"CONCATENATE(\"LASTEN \",jaar_id,\" inclusief balanspost \")","v":"LASTEN 2023 inclusief balanspost "},{"$f":"CONCATENATE(\"Ontvangen en geaccepteerde declaraties m.b.t. \",jaar_id)","v":"Ontvangen en geaccepteerde declaraties m.b.t. 2023"},{"$f":"CONCATENATE(\"LASTEN \",jaar_id-1,\" inclusief balanspost \")","v":"LASTEN 2022 inclusief balanspost "},{"$f":"CONCATENATE(\"Ontvangen en geaccepteerde declaraties m.b.t. \",jaar_id-1)","v":"Ontvangen en geaccepteerde declaraties m.b.t. 2022"},{"$f":"CONCATENATE(\"Ontvangen en geaccepteerde declaraties m.b.t. \",jaar_id-2, \" en ouder\")","v":"Ontvangen en geaccepteerde declaraties m.b.t. 2021 en ouder"}]
[null,null,null,null,null,null,null,null,"Ontvangen en geaccepteerde declaraties mbt jaar T-1",null,"Ontvangen en geaccepteerde declaraties mbt jaar T-1","Ontvangen en geaccepteerde declaraties mbt jaar T-1"]
[null,null,null," Kosten van eerstelijnsdiagnostiek aangevraagd \n door eerstelijns zorgaanbieders, geleverd door \n huisartsenlaboratoria"]
[null,null,null," Trombosediensten"]
{"$rows_left_out":112}
{"sheet":"Contractinformatie","index":8,"n_rows":102,"n_cols":12,"rows_kept":102,"cut":false,"hidden":false,"merged":[[94,3,94,11],[98,3,98,8],[75,3,75,8],[76,3,76,8],[85,3,85,8],[86,3,86,8],[91,3,91,8],[84,3,84,8],[87,3,87,8],[92,3,92,8],[97,3,97,8],[79,3,79,10],[30,3,30,8],[31,3,31,8],[43,3,43,8],[44,3,44,8],[63,3,63,8],[55,3,56,8],[57,3,57,8],[58,3,58,8],[59,3,59,8],[60,3,60,8],[61,3,61,8],[62,3,62,8],[25,9,26,9],[10,11,11,11],[16,3,16,11],[12,3,12,11],[10,10,11,10],[10,9,11,9],[14,3,14,8],[15,3,15,8],[25,3,26,8],[17,3,17,8],[18,3,18,8],[19,3,19,8],[22,3,22,8],[20,3,20,8],[21,3,21,8],[55,11,56,11],[25,10,26,10],[55,10,56,10],[35,11,36,11],[25,11,26,11],[35,10,36,10],[35,9,36,9],[35,3,36,8],[39,3,39,8],[40,3,40,8],[49,3,49,4],[48,3,48,8],[55,9,56,9],[41,3,41,8],[42,3,42,8],[47,3,47,8],[45,3,45,8],[65,3,65,8],[64,3,64,8],[101,3,101,4],[88,3,88,11],[71,11,72,11],[71,10,72,10],[78,5,78,9],[78,3,78,4],[80,10,81,10],[80,11,81,11],[82,3,82,11],[80,9,81,9],[71,9,72,9],[71,3,72,8],[80,3,81,8],[83,3,83,8]]}
[null,null,"INVULSPECIFICATIES SPECIFIEKE INFORMATIE C"]
[]
[]
[]
[]
["Pagina 1",null,null,{"$f":"CONCATENATE(\"JAARSTAAT ZVW \", jaar_id)","v":"JAARSTAAT ZVW 2023"}]
[null,null,null,"SPECIFIEKE INFORMATIE C (CONTRACTINFORMATIE)"]
[null,null,null,{"$f":"IF(naw_uzovi_zorgverzekeraar<>\"0000\",CONCATENATE(UPPER(naw_naam_zorgverzekeraar),\", \",UPPER(naw_plaats_zorgverzekeraar)),\"\")","v":""},null,null,null,null,null,null,null,{"$f":"CONCATENATE(\"UZOVI: \",naw_uzovi_zorgverzekeraar)","v":"UZOVI: 0000"}]
[]
[null,null,null,"CONTRACTINFORMATIE HUISARTSENZORG EN MULTIDISCIPLINAIRE ZORG, rubriek 01"]
[null,null,null,null,null,null,null,null,null,"Lasten inclusief balanspost 2023","Lasten inclusief balanspost 2022","Lasten inclusief balanspost 2021"]
[null,null,null,null,null,null,null,null,null,"Ontvangen en geaccepteerde declaraties mbt jaar T","Ontvangen en geaccepteerde declaraties mbt jaar T","Ontvangen en geaccepteerde declaraties mbt jaar T"]
[null,null,null," Huisartsenzorg, codes 503, 504, 505, 506,507, 515"]
[null,null,null," Gecontracteerde zorg"]
[null,null,null," Niet gecontracteerde zorg"]
{"$rows_left_out":88}
{"sheet":"Controleoverzicht","index":9,"n_rows":252,"n_cols":12,"rows_kept":252,"cut":false,"hidden":false,"merged":[[176,11,177,11],[176,9,177,9],[176,10,177,10],[164,3,164,8],[165,3,165,8],[105,10,106,10],[83,11,84,11],[91,3,91,9],[88,3,88,9],[86,3,86,9],[94,3,94,9],[100,3,100,8],[97,3,97,9],[92,3,92,9],[89,3,89,9],[207,3,207,8],[200,3,200,8],[201,3,201,8],[188,3,188,8],[189,3,189,8],[124,3,124,8],[122,3,122,8],[123,3,123,8],[150,3,150,8],[160,3,160,8],[205,3,205,8],[179,3,179,8],[180,3,180,8],[182,3,182,8],[178,3,178,8],[159,3,159,8],[157,3,157,8],[158,3,158,8],[128,3,128,8],[181,3,181,8],[194,3,194,8],[206,3,206,8],[25,3,25,8],[110,3,110,8],[71,3,71,9],[87,3,87,9],[63,3,63,9],[93,3,93,9],[37,3,37,9],[35,3,35,9],[42,3,42,9],[38,3,38,9],[52,3,52,9],[34,3,34,9],[41,3,41,9],[27,3,28,9],[40,3,40,9],[32,3,32,9],[36,3,36,9],[99,3,99,8],[85,3,85,9],[98,3,98,8],[107,3,107,8],[27,11,28,11],[186,11,187,11],[204,3,204,8],[193,3,193,8],[186,9,187,9],[186,10,187,10],[198,10,199,10],[198,11,199,11],[202,3,202,8],[190,3,190,8],[186,3,187,8],[198,9,199,9],[191,3,191,8],[192,3,192,8],[195,3,195,8],[119,11,120,11],[119,9,120,9],[119,10,120,10],[119,3,120,8],[129,3,129,8],[176,3,177,8],[161,3,161,8],[162,3,162,8],[163,3,163,8],[203,3,203,8],[198,3,199,8],[105,11,106,11],[24,3,24,8],[11,3,11,8],[15,3,15,8],[17,3,18,8],[13,10,14,10],[22,11,23,11],[22,10,23,10],[22,9,23,9],[22,3,23,8],[20,3,20,8],[50,11,51,11],[70,3,70,9],[54,3,54,9],[53,3,53,9],[59,3,59,9],[62,3,62,9],[61,3,61,9],[64,3,64,9],[65,3,65,9],[66,3,66,9],[102,3,102,9],[27,10,28,10],[57,3,57,9],[43,3,43,9],[33,3,33,9],[29,3,29,9],[31,3,31,9],[50,10,51,10],[30,3,30,9],[183,3,183,8],[101,3,101,8],[105,9,106,9],[96,3,96,9],[112,3,112,8],[155,3,156,8],[149,3,149,8],[121,3,121,8],[83,10,84,10],[9,11,10,11],[9,9,10,9],[13,9,14,9],[9,3,10,8],[9,10,10,10],[17,10,18,10],[17,9,18,9],[19,3,19,8],[13,3,14,8],[17,11,18,11],[13,11,14,11],[39,3,39,9],[50,3,51,9],[55,3,55,9],[56,3,56,9],[72,3,72,9],[90,3,90,9],[111,3,111,8],[109,3,109,8],[105,3,106,8],[108,3,108,8],[60,3,60,9],[58,3,58,9],[67,3,67,9],[68,3,68,9],[69,3,69,9],[125,3,125,8],[126,3,126,8],[127,3,127,8],[74,3,74,9],[75,3,75,9],[76,3,76,9],[73,3,73,9],[83,3,84,9],[95,3,95,9],[155,10,156,10],[155,9,156,9],[152,3,152,8],[146,11,147,11],[146,10,147,10],[153,3,153,8],[151,3,151,8],[146,3,147,8],[146,9,147,9],[148,3,148,8],[155,11,156,11],[224,11,225,11],[247,3,247,7],[226,3,226,7],[227,3,227,7],[228,3,228,7],[229,3,229,7],[230,3,230,7],[231,3,231,7],[232,3,232,7],[237,3,237,7],[238,3,238,7],[239,3,239,7],[240,3,240,7],[241,3,241,7],[242,3,242,7],[243,3,243,7],[240,9,240,10],[241,9,241,10],[242,9,242,10],[243,9,243,10],[245,3,246,7],[245,8,246,8],[245,9,246,10],[245,11,246,11],[248,3,248,7],[224,9,225,10],[247,9,247,10],[226,9,226,10],[227,9,227,10],[228,9,228,10],[229,9,229,10],[230,9,230,10],[231,9,231,10],[232,9,232,10],[233,9,233,10],[234,9,234,10],[235,9,235,10],[236,9,236,10],[237,9,237,10],[238,9,238,10],[239,9,239,10],[248,9,248,10],[224,3,225,7],[224,8,225,8],[233,3,233,7],[234,3,234,7],[235,3,235,7],[236,3,236,7]]}
[null,null,"SPECIFICATIES CONTROLEOVERZICHT"]
[]
[]
[]
[]
["Pagina 1",null,null,{"$f":"CONCATENATE(\"JAARSTAAT ZVW \", jaar_id)","v":"JAARSTAAT ZVW 2023"}]
[null,null,null,"CONTROLEOVERZICHT"]
[null,null,null,{"$f":"IF(naw_uzovi_zorgverzekeraar<>\"0000\",CONCATENATE(UPPER(naw_naam_zorgverzekeraar),\", \",UPPER(naw_plaats_zorgverzekeraar)),\"\")","v":""},null,null,null,null,null,null,null,{"$f":"CONCATENATE(\"UZOVI: \",naw_uzovi_zorgverzekeraar)","v":"UZOVI: 0000"}]
[null,null,null,"SPECIFIEKE INFORMATIE 2023 EN A"]
[null,null,null," SPECIFICATIES KOSTEN NAAR DEELBIJDRAGE",null,null,null,null,null,"Lasten 2023 inclusief balanspost","Kosten naar deelbijdrage","Verschil"]
[]
[null,null,null," Totaal kosten naar deelbijdrage (totaal lasten t/m rubriek 16) - \n inclusief balanspost",null,null,null,null,null,{"$f":"Kostenverzamelstaat!I145","v":0},{"$f":"'Specifieke informatie A'!K17","v":0},{"$f":"IF(J12<>K12,J12-K12,\"\")","v":""}]
[]
[null,null,null," SPECIFICATIES KOSTEN NAAR DEELBIJDRAGE",null,null,null,null,null,"Ontvangen en \ngeaccepteerde \ndeclaraties mbt \n2021 en ouder","Kosten naar deelbijdrage","Verschil"]
[]
{"$rows_left_out":238}
{"sheet":"Blad1","index":10,"n_rows":860,"n_cols":12,"rows_kept":860,"cut":false,"hidden":true,"merged":[]}
[]
[]
[]
[]
[]
[]
[]
[]
[]
[]
[]
[null,null,null,null,"vcd_spec_idvar","vcd_waarde_flt","vcd_waarde_txt","vcd_toelichting_txt","vcd_spec1_idvar","vcd_spec2_idvar","vcd_spec3_idvar","vcd_attrib_idvar"]
[null,null,null,null,"xstaat_kdrwet_id_",{"$f":"0","v":0},"ZVWY","Excel numeriek om te zetten sleutel kdrwet via waarden","xstaat","kdrwet","id",""]
[null,null,null,null,"xstaat_kdrwet_idjmd_",{"$f":"0","v":0},20231231,"Excel numeriek om te zetten sleutel kdrwet periode","xstaat","kdrwet","idjmd",""]
[null,null,null,null,"xstaat_uzovi_filename_",{"$f":"0","v":0},{"$f":"CELL(\"bestandsnaam\")","v":"G:\\verwerk\\vsd_prod\\formats\\jaarstaat\\ZVW\\2023\\[Beveiligd format Jaarstaat ZVW 2023 (versie A).xlsm]Controleoverzicht"},"Excel numeriek filenaam bevat ook sleutels","xstaat","uzovi","filename",""]
{"$rows_left_out":846}
{"sheet":"Parameters","index":11,"n_rows":62,"n_cols":12,"rows_kept":62,"cut":false,"hidden":true,"merged":[[0,10,0,11]]}
[null,null,null,null,"Alle mogelijke modelovereenkomsten 2023 waaruit gekozen kan worden",null,null,null,null,null,"Weergave van de gekozen modelovereenkomsten (voor het doorsluizen naar Blad1)"]
["Kwartaal:",null,null,null,"nummer DWH","Naam modelovereenkomst","verzekeraar","Combi","nummer DWH",null,"Overeenkomst","Keuze"]
["Jaar:",2023,null,null,80,"De Friesland Alles Verzorgd Polis","De Friesland Zorgverzekeraar N.V.",{"$f":"E3&\"  \"&F3","v":"80  De Friesland Alles Verzorgd Polis"},80,null,1,{"$f":"IFERROR(VLOOKUP('Specifieke informatie A'!I74,Parameters!$H$2:$I$68,2,FALSE),\"\")","v":""}]
["Wet:","ZVW",null,null,109,"De Friesland Zelf Bewust Polis","De Friesland Zorgverzekeraar N.V.","109  De Friesland Zelf Bewust Polis",109,null,2,{"$f":"IFERROR(VLOOKUP('Specifieke informatie A'!K74,Parameters!$H$2:$I$68,2,FALSE),\"\")","v":""}]
["Document:",{"$f":"CONCATENATE(\"JS\",jaar_id,wet_id,\".\",kwartaal_id,revisie_id)","v":"JS2023ZVW.A"},null,null,104,"FBTO Zorgverzekering Basis Plus","FBTO Zorgverzekeringen N.V.","104  FBTO Zorgverzekering Basis Plus",104,null,3,{"$f":"IFERROR(VLOOKUP('Specifieke informatie A'!M74,Parameters!$H$2:$I$68,2,FALSE),\"\")","v":""}]
["Revisie:","A",null,null,105,"FBTO Zorgverzekering Basis Vrij","FBTO Zorgverzekeringen N.V.","105  FBTO Zorgverzekering Basis Vrij",105,null,4,{"$f":"IFERROR(VLOOKUP('Specifieke informatie A'!O74,Parameters!$H$2:$I$68,2,FALSE),\"\")","v":""}]
["Revisiedatum:","2023-11-01",null,null,130,"FBTO Zorgverzekering Basis","FBTO Zorgverzekeringen N.V.","130  FBTO Zorgverzekering Basis",130,null,5,{"$f":"IFERROR(VLOOKUP('Specifieke informatie A'!Q74,Parameters!$H$2:$I$68,2,FALSE),\"\")","v":""}]
["Versie:",{"$f":"CONCATENATE(document_id,)","v":"JS2023ZVW.A"},null,null,27,"Interpolis ZorgActief ","Interpolis Zorgverzekeringen N.V.","27  Interpolis ZorgActief ",27,null,6,{"$f":"IFERROR(VLOOKUP('Specifieke informatie A'!S74,Parameters!$H$2:$I$68,2,FALSE),\"\")","v":""}]
[null,null,null,null,113,"Interpolis ZorgCompact","Interpolis Zorgverzekeringen N.V.","113  Interpolis ZorgCompact",113]
[null,null,null,null,55,"Zilveren Kruis Basis Zeker","Zilveren Kruis Zorgverzekeringen N.V.","55  Zilveren Kruis Basis Zeker",55]
[null,null,null,null,66,"Zilveren Kruis Basis Exclusief","Zilveren Kruis Zorgverzekeringen N.V.","66  Zilveren Kruis Basis Exclusief",66]
["NUMMER_UO","NAAM_UO","FORMAT_UO1",null,85,"Zilveren Kruis Basis Budget","Zilveren Kruis Zorgverzekeringen N.V.","85  Zilveren Kruis Basis Budget",85]
["0000","KIES UW UZOVI-NUMMER",{"$f":"CONCATENATE(A13,\" \",B13)","v":"0000 KIES UW UZOVI-NUMMER"},null,91,"Pro Life Principe Polis (natura)","Zilveren Kruis Zorgverzekeringen N.V.","91  Pro Life Principe Polis (natura)",91]
["0101","UNIVÉ ZORG","0101 UNIVÉ ZORG",null,114,"Pro Life Principe Polis Budget","Zilveren Kruis Zorgverzekeringen N.V.","114  Pro Life Principe Polis Budget",114]
["0104","CENTRALE ZORGVERZEKERINGEN NZV N.V.","0104 CENTRALE ZORGVERZEKERINGEN NZV N.V.",null,108,"ZieZo Basis","Zilveren Kruis Zorgverzekeringen N.V.","108  ZieZo Basis",108]
{"$rows_left_out":47}