{"text_format":"1","workbook":"xlsx","n_sheets":11,"sheets":["Hoofdmenu","Toelichting","NAW_gegevens","Voorblad","Kostenverzamelstaat","Specifieke informatie A","Specifieke informatie C","Contractinformatie","Controleoverzicht","Blad1","Parameters"],"not_rendered":{"charts":0,"images":1,"macros":1,"external_links":0,"defined_names":224,"comments":1,"pivot_tables":0},"unopened":[],"bounds":{"document_bytes":16777216,"sheet_cells":100000,"rows_first":2000,"rows_last":500,"rows_between":2000,"halvings":0,"cell_chars":16384,"cell_head_chars":4096},"cells_cut":0,"cells_raw":0,"read":"whole","date_system":"1900"}

{"sheet":"Hoofdmenu","index":0,"n_rows":3,"n_cols":2,"rows_kept":3,"cut":false,"hidden":false,"merged":[[0,0,0,1],[1,0,1,1]]}
["HOOFDMENU"]
["JAARSTAAT ZVW 2025"]
["Navigatie","Afdrukken"]

{"sheet":"Toelichting","index":1,"n_rows":3,"n_cols":2,"rows_kept":3,"cut":false,"hidden":false,"merged":[]}
[]
[]
[null,{"$f":"CONCATENATE(\" JAARSTAAT ZVW \",jaar_id,\" (VERSIE: \",document_id,\")\")","v":" JAARSTAAT ZVW 2025 (VERSIE: JS2025ZVW.B)"}]

{"sheet":"NAW_gegevens","index":2,"n_rows":36,"n_cols":5,"rows_kept":36,"cut":false,"hidden":false,"merged":[[2,0,2,1],[3,0,3,1]]}
[]
[]
["NAW-GEGEVENS"]
["JAARSTAAT ZVW  2025"]
[" Selecteer uw nummer:>","0000 KIES UW UZOVI-NUMMER"]
[" Uzovi-nummer:",{"$f":"MID(keuze_uzovi_nummer,1,4)","v":"0000"}]
[" Verzekeraar:",{"$f":"MID(keuze_uzovi_nummer,6,40)","v":"KIES UW UZOVI-NUMMER"}]
[" Plaats:",{"$f":"VLOOKUP(naw_uzovi_zorgverzekeraar,A17:E36,5,FALSE)","v":{"$error":"#N/A"}}]
[" Contactpersoon:"]
[" Telefoonnummer:"]
[" E-mail:"]
[]
[]
["Let op dat u het goede UZOVI-nummer invult, zie onderstaand overzicht:"]
[]
["UZOVI","NAAM",null,null,"PLAATS"]
["0101","N.V. UNIVÉ ZORG",null,null,"ARNHEM"]
["0104","CENTRALE ZORGVERZEKERINGEN NZV N.V.",null,null,"TILBURG"]
["0201","OHRA ZORGVERZEKERINGEN N.V.",null,null,"TILBURG"]
["0403","ASR BASIS ZIEKTEKOSTENVERZEKERINGEN N.V.",null,null,"UTRECHT"]
{"$rows_left_out":17}
{"sheet":"Voorblad","index":3,"n_rows":33,"n_cols":4,"rows_kept":33,"cut":false,"hidden":false,"merged":[[13,3,14,11],[15,3,16,11],[19,3,20,11],[21,3,22,11]]}
[null,null,"VOORBLAD"]
[]
[]
[]
[]
["Pagina 1"]
[]
[]
[]
[]
[]
[]
[]
[]
[]
[null,null,null,{"$f":"CONCATENATE(\"JAARSTAAT ZVW \",jaar_id)","v":"JAARSTAAT ZVW 2025"}]
[]
[]
[]
[null,null,null,"SPECIFIEKE INFORMATIE"]
{"$rows_left_out":14}
{"sheet":"Kostenverzamelstaat","index":4,"n_rows":129,"n_cols":16,"rows_kept":129,"cut":false,"hidden":false,"merged":[[121,12,122,12],[10,12,11,12],[12,12,13,12],[89,12,90,12],[91,12,92,12],[82,9,82,12],[82,3,82,4],[66,3,66,6],[67,3,67,6],[59,3,59,6],[70,3,70,6],[72,3,72,6],[75,3,75,6],[68,3,68,6],[69,3,69,6],[77,3,77,6],[78,3,78,6],[124,3,124,6],[128,3,128,4],[121,9,122,9],[121,10,122,10],[121,11,122,11],[121,3,122,6],[121,7,122,7],[121,8,122,8],[123,3,123,6],[89,3,92,6],[89,8,90,9],[89,10,90,11],[91,7,92,7],[91,8,92,8],[91,9,92,9],[91,10,92,10],[91,11,92,11],[95,3,95,6],[96,3,96,6],[98,3,98,7],[94,3,94,6],[41,9,41,12],[48,10,49,11],[50,7,51,7],[50,8,51,8],[50,9,51,9],[50,10,51,10],[50,11,51,11],[48,12,49,12],[50,12,51,12],[48,3,51,6],[55,3,55,6],[57,3,57,6],[19,3,19,6],[41,3,41,4],[40,3,40,4],[20,3,20,6],[21,3,21,6],[22,3,22,6],[10,3,13,6],[10,8,11,9],[10,10,11,11],[12,7,13,7],[12,8,13,8],[12,9,13,9],[12,10,13,10],[12,11,13,11],[58,3,58,6],[48,8,49,9],[76,3,76,6],[60,3,60,6],[61,3,61,6],[64,3,64,6],[65,3,65,6]]}
[null,null,"INVULSPECIFICATIES SPECIFIEKE INFORMATIE A"]
[]
[]
[]
[]
["Pagina 1",null,null,{"$f":"CONCATENATE(\"JAARSTAAT ZVW \", jaar_id)","v":"JAARSTAAT ZVW 2025"}]
[null,null,null,"SPECIFIEKE INFORMATIE A: KOSTENVERZAMELSTAAT"]
[null,null,null,{"$f":"IF(naw_uzovi_zorgverzekeraar<>\"0000\",CONCATENATE(UPPER(naw_naam_zorgverzekeraar),\", \",UPPER(naw_plaats_zorgverzekeraar)),\"\")","v":""},null,null,null,null,null,null,null,null,{"$f":"CONCATENATE(\"UZOVI: \",naw_uzovi_zorgverzekeraar)","v":"UZOVI: 0000"}]
[null,null,null,"SPECIFICATIES INFORMATIE RISICOVEREVENING"]
[null,null,null,{"$f":"$D$7","v":"SPECIFIEKE INFORMATIE A: KOSTENVERZAMELSTAAT"}]
[null,null,null," KOSTENRUBRIEK",null,null,null,null,{"$f":"CONCATENATE(\"LASTEN \",jaar_id)","v":"LASTEN 2025"},null,{"$f":"CONCATENATE(\"LASTEN \",jaar_id-1)","v":"LASTEN 2024"},null,{"$f":"CONCATENATE(\"LASTEN \",jaar_id-2)","v":"LASTEN 2023"}]
[]
[null,null,null,null,null,null,null,"Code",{"$f":"CONCATENATE(\"LASTEN \",jaar_id,\" inclusief balanspost \")","v":"LASTEN 2025 inclusief balanspost "},{"$f":"CONCATENATE(\"Ontvangen en geaccepteerde declaraties m.b.t. \",jaar_id)","v":"Ontvangen en geaccepteerde declaraties m.b.t. 2025"},{"$f":"CONCATENATE(\"LASTEN \",jaar_id-1,\" inclusief balanspost \")","v":"LASTEN 2024 inclusief balanspost "},{"$f":"CONCATENATE(\"Ontvangen en geaccepteerde declaraties m.b.t. \",jaar_id-1)","v":"Ontvangen en geaccepteerde declaraties m.b.t. 2024"},{"$f":"CONCATENATE(\"Ontvangen en geaccepteerde declaraties m.b.t. \",jaar_id-2, \" en ouder\")","v":"Ontvangen en geaccepteerde declaraties m.b.t. 2023 en ouder"}]
[null,null,null,null,null,null,null,null,null,"Ontvangen en geaccepteerde declaraties mbt jaar T",null,"Ontvangen en geaccepteerde declaraties mbt jaar T","Ontvangen en geaccepteerde declaraties mbt jaar T"]
[null,null,null," 01  HUISARTSENZORG en MDZ"]
[null,null,null," Bijzondere betalingen",null,null,null,"503   ",null,null,null,null,null,null,null,{"$f":"IF(OR((I16-J16)/IF(I16=0,1,I16)<-10%,(K16-L16)/IF(K16=0,1,K16)<-10%),\"De balans is < -10%, als dit plausibel is dan vragen wij u dit nader toe te lichten bij de opmerkingen, zo niet dan dient u uw raming aan te scherpen.\",\"\")","v":""}]
[null,null,null," Avond-, nacht- en weekenddiensten",null,null,null,"504   ",null,null,null,null,null,null,null,""]
[null,null,null," Inschrijftarieven",null,null,null,"505   ",null,null,null,null,null,null,null,""]
[null,null,null," Consulttarieven",null,null,null,"506   ",null,null,null,null,null,null,null,""]
[null,null,null," Overige tarieven",null,null,null,"507   ",null,null,null,null,null,null,null,""]
{"$rows_left_out":110}
{"sheet":"Specifieke informatie A","index":5,"n_rows":99,"n_cols":20,"rows_kept":99,"cut":false,"hidden":false,"merged":[[40,11,41,11],[46,11,47,11],[52,11,53,11],[29,11,30,11],[24,11,25,11],[24,10,25,10],[15,3,15,9],[16,3,16,9],[29,10,30,10],[29,3,30,9],[27,3,27,9],[40,3,41,9],[43,3,43,9],[31,3,31,9],[26,3,26,9],[42,3,42,9],[13,3,13,9],[11,10,12,10],[11,3,12,9],[14,3,14,9],[11,11,12,11],[19,10,20,10],[21,3,21,9],[22,3,22,9],[24,3,25,9],[19,3,20,9],[19,11,20,11],[63,3,63,4],[46,3,47,9],[46,10,47,10],[33,3,33,4],[54,3,56,4],[54,5,54,9],[55,5,55,9],[56,5,56,9],[52,3,53,9],[52,10,53,10],[57,3,57,9],[60,3,60,9],[61,3,61,9],[40,10,41,10],[48,3,48,9],[49,3,49,9],[50,3,50,9],[71,16,71,17],[71,18,71,19],[72,3,73,7],[72,8,73,8],[72,9,73,9],[72,10,73,10],[72,11,73,11],[72,12,73,12],[72,13,73,13],[72,14,73,14],[72,15,73,15],[72,16,73,16],[72,17,73,17],[72,18,73,18],[72,19,73,19],[70,3,71,7],[71,8,71,9],[71,10,71,11],[71,12,71,13],[71,14,71,15],[79,3,79,7],[80,3,80,7],[81,3,81,7],[82,3,82,7],[83,3,83,7],[74,3,74,7],[75,3,75,7],[76,3,76,7],[77,3,77,7],[78,3,78,7],[89,3,89,7],[90,3,90,7],[91,3,91,7],[92,3,92,7],[93,3,93,7],[84,3,84,7],[85,3,85,7],[86,3,86,7],[87,3,87,7],[88,3,88,7],[96,3,96,7],[98,3,98,4],[93,18,93,19],[94,3,95,7],[94,8,94,9],[94,10,94,11],[94,12,94,13],[94,14,94,15],[94,16,94,17],[94,18,94,19],[95,8,95,9],[95,10,95,11],[95,12,95,13],[95,14,95,15],[95,16,95,17],[95,18,95,19],[93,8,93,9],[93,10,93,11],[93,12,93,13],[93,14,93,15],[93,16,93,17]]}
[null,null,"INVULSPECIFICATIES SPECIFIEKE INFORMATIE A"]
[]
[]
[]
[]
["Pagina 1",null,null,{"$f":"CONCATENATE(\"JAARSTAAT ZVW \", jaar_id)","v":"JAARSTAAT ZVW 2025"}]
[null,null,null,"SPECIFIEKE INFORMATIE A  2025: DETAILINFORMATIE RVE"]
[null,null,null,{"$f":"IF(naw_uzovi_zorgverzekeraar<>\"0000\",CONCATENATE(UPPER(naw_naam_zorgverzekeraar),\", \",UPPER(naw_plaats_zorgverzekeraar)),\"\")","v":""},null,null,null,null,null,null,null,{"$f":"CONCATENATE(\"UZOVI: \",naw_uzovi_zorgverzekeraar)","v":"UZOVI: 0000"}]
[]
[null,null,null,"SPECIFICATIES INFORMATIE RISICOVEREVENING"]
[null,null,null,"KOSTEN NAAR DEELBIJDRAGE"]
[null,null,null," KOSTEN NAAR DEELBIJDRAGE",null,null,null,null,null,null,{"$f":"CONCATENATE(\"LASTEN \",jaar_id,\" inclusief balanspost \")","v":"LASTEN 2025 inclusief balanspost "},{"$f":"CONCATENATE(\"LASTEN \",jaar_id-2,\" ontvangen en geaccepteerde declaraties en ouder \")","v":"LASTEN 2023 ontvangen en geaccepteerde declaraties en ouder "}]
[]
[null,null,null," Variabele zorgkosten"]
[null,null,null," Vaste zorgkosten "]
[null,null,null," Kosten geneeskundige geestelijke gezondheidszorg"]
[null,null,null," TOTAAL kosten ",null,null,null,null,null,null,{"$f":"SUM(K14:K16)","v":0},{"$f":"SUM(L14:L16)","v":0}]
[]
[null,null,null,"RUBRIEK 02 FARMACEUTISCHE ZORG"]
[null,null,null," CODE 520 - KOSTEN VAN BEPAALDE DURE EXTRAMURALE GENEESMIDDELEN",null,null,null,null,null,null,{"$f":"K$12","v":"LASTEN 2025 inclusief balanspost "},{"$f":"L$12","v":"LASTEN 2023 ontvangen en geaccepteerde declaraties en ouder "}]
{"$rows_left_out":80}
{"sheet":"Specifieke informatie C","index":6,"n_rows":102,"n_cols":12,"rows_kept":102,"cut":false,"hidden":false,"merged":[[62,11,63,11],[87,5,87,9],[23,3,23,6],[17,7,17,8],[18,10,19,10],[34,3,34,4],[54,5,54,6],[55,3,55,6],[56,3,56,6],[68,3,68,6],[69,3,69,6],[54,7,54,11],[67,3,67,6],[57,3,57,6],[58,3,58,6],[66,3,66,6],[48,3,48,6],[24,3,24,6],[21,3,21,6],[18,8,19,8],[18,11,19,11],[17,9,17,10],[18,9,19,9],[18,7,19,7],[14,3,14,6],[11,11,12,11],[17,3,19,6],[10,3,12,6],[10,7,10,8],[10,9,10,10],[11,7,12,7],[11,8,12,8],[11,9,12,9],[11,10,12,10],[13,3,13,6],[27,11,28,11],[29,3,29,6],[51,9,51,10],[51,3,53,4],[51,7,51,8],[30,3,30,6],[31,3,31,6],[32,3,32,6],[33,3,33,6],[40,3,42,6],[40,7,40,8],[40,9,40,10],[41,7,42,7],[52,11,53,11],[52,9,53,9],[52,7,53,7],[26,3,28,6],[26,7,26,8],[26,9,26,10],[27,7,28,7],[27,8,28,8],[27,9,28,9],[27,10,28,10],[41,11,42,11],[61,9,61,10],[62,7,63,7],[62,8,63,8],[54,3,54,4],[52,10,53,10],[41,9,42,9],[41,10,42,10],[62,9,63,9],[62,10,63,10],[43,3,43,6],[44,3,44,6],[45,3,45,6],[46,3,46,6],[47,3,47,6],[51,5,53,6],[52,8,53,8],[41,8,42,8],[61,3,63,4],[61,5,63,6],[61,7,61,8],[22,3,22,6],[20,3,20,6],[101,3,101,4],[92,11,93,11],[94,3,95,4],[94,5,94,9],[95,5,95,9],[96,3,96,9],[97,3,97,9],[85,3,86,9],[85,10,86,10],[85,11,86,11],[87,3,88,4],[90,3,90,9],[92,3,93,9],[92,10,93,10],[89,3,89,9],[64,5,64,6],[59,3,59,6],[64,3,64,4],[79,3,79,4],[64,7,64,11],[65,3,65,6],[88,5,88,9]]}
[null,null,"INVULSPECIFICATIES SPECIFIEKE INFORMATIE C"]
[]
[]
[]
[]
["Pagina 1",null,null,{"$f":"CONCATENATE(\"JAARSTAAT ZVW \", jaar_id)","v":"JAARSTAAT ZVW 2025"}]
[null,null,null,"SPECIFIEKE INFORMATIE C: SPECIFICATIES VAN KOSTEN EN PRODUCTIE"]
[null,null,null,{"$f":"IF(naw_uzovi_zorgverzekeraar<>\"0000\",CONCATENATE(UPPER(naw_naam_zorgverzekeraar),\", \",UPPER(naw_plaats_zorgverzekeraar)),\"\")","v":""},null,null,null,null,null,null,null,{"$f":"CONCATENATE(\"UZOVI: \",naw_uzovi_zorgverzekeraar)","v":"UZOVI: 0000"}]
[null,null,null,"SPECIFICATIES VAN KOSTEN EN PRODUCTIE"]
[null,null,null,"RUBRIEK 06 MEDISCH SPECIALISTISCHE ZORG"]
[null,null,null," CODE 610.2\n ",null,null,null,{"$f":"CONCATENATE(\"LASTEN \",jaar_id)","v":"LASTEN 2025"},null,{"$f":"CONCATENATE(\"LASTEN \",jaar_id-1)","v":"LASTEN 2024"},null,{"$f":"CONCATENATE(\"LASTEN \",jaar_id-2)","v":"LASTEN 2023"}]
[null,null,null,null,null,null,null,{"$f":"CONCATENATE(\"LASTEN \",jaar_id,\" inclusief balanspost \")","v":"LASTEN 2025 inclusief balanspost "},{"$f":"CONCATENATE(\"Ontvangen en geaccepteerde declaraties m.b.t. \",jaar_id)","v":"Ontvangen en geaccepteerde declaraties m.b.t. 2025"},{"$f":"CONCATENATE(\"LASTEN \",jaar_id-1,\" inclusief balanspost \")","v":"LASTEN 2024 inclusief balanspost "},{"$f":"CONCATENATE(\"Ontvangen en geaccepteerde declaraties m.b.t. \",jaar_id-1)","v":"Ontvangen en geaccepteerde declaraties m.b.t. 2024"},{"$f":"CONCATENATE(\"Ontvangen en geaccepteerde declaraties m.b.t. \",jaar_id-2, \" en ouder\")","v":"Ontvangen en geaccepteerde declaraties m.b.t. 2023 en ouder"}]
[null,null,null,null,null,null,null,null,"Ontvangen en geaccepteerde declaraties mbt jaar T-1",null,"Ontvangen en geaccepteerde declaraties mbt jaar T-1","Ontvangen en geaccepteerde declaraties mbt jaar T-1"]
[null,null,null," Kosten van eerstelijnsdiagnostiek aangevraagd \n door eerstelijns zorgaanbieders, geleverd door \n huisartsenlaboratoria"]
[null,null,null," Trombosediensten"]
[null,null,null," TOTAAL code 610.2",null,null,null,{"$f":"SUM(H14:H15)","v":0},{"$f":"SUM(I14:I15)","v":0},{"$f":"SUM(J14:J15)","v":0},{"$f":"SUM(K14:K15)","v":0},{"$f":"SUM(L14:L15)","v":0}]
[]
[null,null,null," CODE 611 - OVERIGE ZORGPRODUCTEN NAAR INSTELLINGEN",null," ",null,{"$f":"$H$11","v":"LASTEN 2025"},null,{"$f":"$J$11","v":"LASTEN 2024"},null,{"$f":"$L$11","v":"LASTEN 2023"}]
[null,null,null,null,null,null,null,{"$f":"$H$12","v":"LASTEN 2025 inclusief balanspost "},{"$f":"$I$12","v":"Ontvangen en geaccepteerde declaraties m.b.t. 2025"},{"$f":"$J$12","v":"LASTEN 2024 inclusief balanspost "},{"$f":"$K$12","v":"Ontvangen en geaccepteerde declaraties m.b.t. 2024"},{"$f":"$L$12","v":"Ontvangen en geaccepteerde declaraties m.b.t. 2023 en ouder"}]
[]
{"$rows_left_out":83}
{"sheet":"Contractinformatie","index":7,"n_rows":87,"n_cols":12,"rows_kept":87,"cut":false,"hidden":false,"merged":[[86,3,86,4],[77,3,77,11],[64,11,65,11],[64,10,65,10],[69,5,69,9],[69,3,69,4],[71,10,72,10],[71,11,72,11],[73,3,73,11],[71,9,72,9],[64,9,65,9],[64,3,65,8],[71,3,72,8],[74,3,74,8],[81,3,81,11],[43,3,43,8],[39,3,39,8],[50,9,51,9],[37,3,37,8],[38,3,38,8],[42,3,42,8],[40,3,40,8],[50,11,51,11],[23,10,24,10],[50,10,51,10],[31,11,32,11],[23,11,24,11],[31,10,32,10],[23,9,24,9],[10,11,11,11],[16,3,16,11],[12,3,12,11],[10,10,11,10],[10,9,11,9],[14,3,14,8],[15,3,15,8],[23,3,24,8],[17,3,17,8],[18,3,18,8],[19,3,19,8],[20,3,20,8],[31,9,32,9],[58,3,58,8],[70,3,70,10],[75,3,75,8],[76,3,76,8],[50,3,51,8],[52,3,52,8],[53,3,53,8],[54,3,54,8],[55,3,55,8],[56,3,56,8],[57,3,57,8],[31,3,32,8],[35,3,35,8],[36,3,36,8],[44,3,44,4]]}
[null,null,"INVULSPECIFICATIES SPECIFIEKE INFORMATIE C"]
[]
[]
[]
[]
["Pagina 1",null,null,{"$f":"CONCATENATE(\"JAARSTAAT ZVW \", jaar_id)","v":"JAARSTAAT ZVW 2025"}]
[null,null,null,"SPECIFIEKE INFORMATIE C (CONTRACTINFORMATIE)"]
[null,null,null,{"$f":"IF(naw_uzovi_zorgverzekeraar<>\"0000\",CONCATENATE(UPPER(naw_naam_zorgverzekeraar),\", \",UPPER(naw_plaats_zorgverzekeraar)),\"\")","v":""},null,null,null,null,null,null,null,{"$f":"CONCATENATE(\"UZOVI: \",naw_uzovi_zorgverzekeraar)","v":"UZOVI: 0000"}]
[]
[null,null,null,"CONTRACTINFORMATIE HUISARTSENZORG EN MULTIDISCIPLINAIRE ZORG, rubriek 01"]
[null,null,null,null,null,null,null,null,null,{"$f":"CONCATENATE(\"LASTEN \",jaar_id,\" inclusief balanspost \")","v":"LASTEN 2025 inclusief balanspost "},{"$f":"CONCATENATE(\"LASTEN \",jaar_id-1,\" inclusief balanspost \")","v":"LASTEN 2024 inclusief balanspost "},{"$f":"CONCATENATE(\"LASTEN \",jaar_id-2,\" inclusief balanspost \")","v":"LASTEN 2023 inclusief balanspost "}]
[null,null,null,null,null,null,null,null,null,"Ontvangen en geaccepteerde declaraties mbt jaar T","Ontvangen en geaccepteerde declaraties mbt jaar T","Ontvangen en geaccepteerde declaraties mbt jaar T"]
[null,null,null," Huisartsenzorg, codes 503, 504, 505, 506,507, 515"]
[null,null,null," Gecontracteerde zorg"]
[null,null,null," Niet gecontracteerde zorg"]
[null,null,null," Subtotaal huisartsenzorg",null,null,null,null,null,{"$f":"SUM(J14:J15)","v":0},0,{"$f":"SUM(L14:L15)","v":0}]
[null,null,null," Multidisciplinaire zorg, codes 510 en 516"]
[null,null,null," Gecontracteerde zorg"]
[null,null,null," Niet gecontracteerde zorg"]
[null,null,null," Subtotaal multidisciplinaire zorg",null,null,null,null,null,{"$f":"SUM(J18:J19)","v":0},{"$f":"SUM(K18:K19)","v":0},{"$f":"SUM(L18:L19)","v":0}]
{"$rows_left_out":68}
{"sheet":"Controleoverzicht","index":8,"n_rows":217,"n_cols":12,"rows_kept":217,"cut":false,"hidden":false,"merged":[[180,3,180,8],[173,3,173,8],[174,3,174,8],[158,3,158,8],[159,3,159,8],[153,3,153,8],[134,3,135,8],[128,3,128,8],[142,3,142,8],[140,3,140,8],[141,3,141,8],[179,3,179,8],[176,3,176,8],[178,3,178,8],[177,3,177,8],[129,3,129,8],[138,3,138,8],[146,3,147,8],[137,3,137,8],[148,3,148,8],[171,10,172,10],[171,11,172,11],[175,3,175,8],[160,3,160,8],[156,3,157,8],[171,9,172,9],[161,3,161,8],[162,3,162,8],[165,3,165,8],[164,3,164,8],[171,3,172,8],[163,3,163,8],[87,3,87,9],[85,3,85,9],[69,3,69,9],[54,3,54,9],[53,3,53,9],[58,3,58,9],[61,3,61,9],[60,3,60,9],[63,3,63,9],[64,3,64,9],[65,3,65,9],[59,3,59,9],[57,3,57,9],[66,3,66,9],[67,3,67,9],[68,3,68,9],[70,3,70,9],[81,11,82,11],[9,11,10,11],[9,9,10,9],[13,9,14,9],[9,3,10,8],[9,10,10,10],[17,10,18,10],[17,9,18,9],[19,3,19,8],[13,3,14,8],[17,11,18,11],[13,11,14,11],[11,3,11,8],[15,3,15,8],[17,3,18,8],[13,10,14,10],[28,10,29,10],[24,3,24,8],[22,11,23,11],[22,10,23,10],[22,9,23,9],[22,3,23,8],[25,3,25,8],[28,11,29,11],[111,3,112,8],[119,3,119,8],[100,10,101,10],[100,11,101,11],[115,3,115,8],[117,3,117,8],[118,3,118,8],[116,3,116,8],[100,9,101,9],[107,3,107,8],[104,3,104,8],[100,3,101,8],[102,3,102,8],[103,3,103,8],[113,3,113,8],[50,11,51,11],[28,3,29,9],[40,3,40,9],[41,3,41,9],[33,3,33,9],[37,3,37,9],[20,3,20,8],[97,3,97,9],[73,3,73,9],[74,3,74,9],[72,3,72,9],[81,3,82,9],[90,3,90,9],[86,3,86,9],[84,3,84,9],[88,3,88,9],[89,3,89,9],[95,3,95,8],[92,3,92,9],[94,3,94,8],[83,3,83,9],[93,3,93,8],[96,3,96,8],[34,3,34,9],[30,3,30,9],[127,3,127,8],[139,3,139,8],[50,10,51,10],[31,3,31,9],[50,3,51,9],[55,3,55,9],[71,3,71,9],[56,3,56,9],[43,3,43,9],[105,3,105,8],[81,10,82,10],[36,3,36,9],[42,3,42,9],[39,3,39,9],[52,3,52,9],[35,3,35,9],[32,3,32,9],[106,3,106,8],[108,3,108,8],[114,3,114,8],[62,3,62,9],[38,3,38,9],[111,10,112,10],[146,11,147,11],[146,9,147,9],[146,10,147,10],[125,11,126,11],[134,11,135,11],[156,11,157,11],[156,9,157,9],[156,10,157,10],[91,3,91,9],[134,10,135,10],[136,3,136,8],[149,3,149,8],[150,3,150,8],[152,3,152,8],[151,3,151,8],[134,9,135,9],[131,3,131,8],[125,10,126,10],[132,3,132,8],[130,3,130,8],[125,3,126,8],[125,9,126,9],[111,11,112,11],[111,9,112,9],[190,3,191,7],[190,8,191,8],[190,9,191,10],[190,11,191,11],[192,3,192,7],[192,9,192,10],[193,3,193,7],[193,9,193,10],[210,3,210,7],[210,9,210,10],[194,3,194,7],[194,9,194,10],[195,3,195,7],[195,9,195,10],[196,3,196,7],[196,9,196,10],[197,3,197,7],[197,9,197,10],[211,3,211,7],[211,9,211,10],[198,3,198,7],[198,9,198,10],[199,3,199,7],[199,9,199,10],[200,3,200,7],[200,9,200,10],[201,3,201,7],[201,9,201,10],[202,3,202,7],[202,9,202,10],[208,3,209,7],[208,8,209,8],[208,9,209,10],[208,11,209,11],[213,3,213,7],[213,9,213,10],[203,3,203,7],[203,9,203,10],[204,3,204,7],[204,9,204,10],[205,3,205,7],[205,9,205,10],[212,3,212,7],[212,9,212,10],[206,3,206,7],[206,9,206,10]]}
[null,null,"SPECIFICATIES CONTROLEOVERZICHT"]
[]
[]
[]
[]
["Pagina 1",null,null,{"$f":"CONCATENATE(\"JAARSTAAT ZVW \", jaar_id)","v":"JAARSTAAT ZVW 2025"}]
[null,null,null,"CONTROLEOVERZICHT",null,null,null,null,null,null,null,{"$f":"CONCATENATE(\"UZOVI: \",naw_uzovi_zorgverzekeraar)","v":"UZOVI: 0000"}]
[null,null,null,{"$f":"IF(naw_uzovi_zorgverzekeraar<>\"0000\",CONCATENATE(UPPER(naw_naam_zorgverzekeraar),\", \",UPPER(naw_plaats_zorgverzekeraar)),\"\")","v":""}]
[null,null,null,"VERGELIJKING KOSTENVERZAMELSTAAT EN SPECIFIEKE INFORMATIE A "]
[null,null,null," SPECIFICATIES KOSTEN NAAR DEELBIJDRAGE",null,null,null,null,null,{"$f":"CONCATENATE(\"LASTEN \",jaar_id,\" inclusief balanspost \")","v":"LASTEN 2025 inclusief balanspost "},"Kosten naar deelbijdrage","Verschil"]
[]
[null,null,null," Totaal kosten naar deelbijdrage (totaal lasten t/m rubriek 16) - \n inclusief balanspost",null,null,null,null,null,{"$f":"Kostenverzamelstaat!I120","v":0},{"$f":"'Specifieke informatie A'!K17","v":0},{"$f":"IF(J12<>K12,J12-K12,\"\")","v":""}]
[]
[null,null,null," SPECIFICATIES KOSTEN NAAR DEELBIJDRAGE",null,null,null,null,null,{"$f":"CONCATENATE(\"LASTEN \",jaar_id-2,\" ontvangen en geaccepteerde declaraties \")","v":"LASTEN 2023 ontvangen en geaccepteerde declaraties "},"Kosten naar deelbijdrage","Verschil"]
[]
[null,null,null," Totaal kosten naar deelbijdrage (totaal lasten t/m rubriek 16)",null,null,null,null,null,{"$f":"Kostenverzamelstaat!M120","v":0},{"$f":"'Specifieke informatie A'!L17","v":0},{"$f":"IF(J16<>K16,J16-K16,\"\")","v":""}]
[]
[null,null,null," KOSTEN PER CODENUMMER - LASTEN 2025 INCLUSIEF BALANSPOST",null,null,null,null,null,"Volgens\nkostenver- \nzamelstaat","Volgens\ndetail- \nspecificatie ","Verschil"]
[]
[null,null,null," 720 Grensoverschrijdende zorg -Kosten via verzekeraar",null,null,null,null,null,{"$f":"Kostenverzamelstaat!I114","v":0},{"$f":"'Specifieke informatie A'!K51","v":0},{"$f":"IF(J20<>K20,J20-K20,\"\")","v":""}]
{"$rows_left_out":198}
{"sheet":"Blad1","index":9,"n_rows":705,"n_cols":12,"rows_kept":705,"cut":false,"hidden":true,"merged":[]}
[]
[]
[]
[]
[]
[]
[]
[]
[]
[]
[]
[null,null,null,null,"vcd_spec_idvar","vcd_waarde_flt","vcd_waarde_txt","vcd_toelichting_txt","vcd_spec1_idvar","vcd_spec2_idvar","vcd_spec3_idvar","vcd_attrib_idvar"]
[null,null,null,null,"xstaat_kdrwet_id_","*=0","ZVWY","Excel numeriek om te zetten sleutel kdrwet via waarden","xstaat","kdrwet","id",""]
[null,null,null,null,"xstaat_kdrwet_idjmd_","*=0",20251231,"Excel numeriek om te zetten sleutel kdrwet periode","xstaat","kdrwet","idjmd",""]
[null,null,null,null,"xstaat_uzovi_filename_","*=0","*=@CEL(\"bestandsnaam\")","Excel numeriek filenaam bevat ook sleutels","xstaat","uzovi","filename",""]
[null,null,null,null,"xstaat_uzovi_id_","*=0","*=NUMERIEKE.WAARDE(NAW_gegevens!$B$6)","Excel numeriek om te zetten sleutel uzovi","xstaat","uzovi","id",""]
[null,null,null,null,"xstaat_uzovi_idvrs_","*=0","01","Excel numeriek om te zetten sleutel uzovi versie levering","xstaat","uzovi","idvrs",""]
[null,null,null,null,"zvkx01_c__TY0V01","*=Kostenverzamelstaat!$I$24"]
[null,null,null,null,"zvkx01_a__TY0V01","*=Kostenverzamelstaat!$J$24"]
[null,null,null,null,"zvkx01_c__TY1V01","*=Kostenverzamelstaat!$K$24"]
{"$rows_left_out":686}
{"sheet":"Parameters","index":10,"n_rows":62,"n_cols":12,"rows_kept":62,"cut":false,"hidden":true,"merged":[[0,10,0,11]]}
[null,null,null,null,"Alle mogelijke modelovereenkomsten 2023 waaruit gekozen kan worden",null,null,null,null,null,"Weergave van de gekozen modelovereenkomsten (voor het doorsluizen naar Blad1)"]
["Kwartaal:",null,null,null,"nummer DWH","Naam modelovereenkomst","verzekeraar","Combi","nummer DWH",null,"Overeenkomst","Keuze"]
["Jaar:",2025,null,null,80,"De Friesland Alles Verzorgd Polis","De Friesland Zorgverzekeraar N.V.",{"$f":"E3&\"  \"&F3","v":"80  De Friesland Alles Verzorgd Polis"},80,null,1,{"$f":"IFERROR(VLOOKUP('Specifieke informatie A'!I72,Parameters!$H$2:$I$68,2,FALSE),\"\")","v":""}]
["Wet:","ZVW",null,null,109,"De Friesland Zelf Bewust Polis","De Friesland Zorgverzekeraar N.V.","109  De Friesland Zelf Bewust Polis",109,null,2,{"$f":"IFERROR(VLOOKUP('Specifieke informatie A'!K72,Parameters!$H$2:$I$68,2,FALSE),\"\")","v":""}]
["Document:",{"$f":"CONCATENATE(\"JS\",jaar_id,wet_id,\".\",kwartaal_id,revisie_id)","v":"JS2025ZVW.B"},null,null,104,"FBTO Zorgverzekering Basis Plus","FBTO Zorgverzekeringen N.V.","104  FBTO Zorgverzekering Basis Plus",104,null,3,{"$f":"IFERROR(VLOOKUP('Specifieke informatie A'!M72,Parameters!$H$2:$I$68,2,FALSE),\"\")","v":""}]
["Revisie:","B",null,null,105,"FBTO Zorgverzekering Basis Vrij","FBTO Zorgverzekeringen N.V.","105  FBTO Zorgverzekering Basis Vrij",105,null,4,{"$f":"IFERROR(VLOOKUP('Specifieke informatie A'!O$72,Parameters!$H$2:$I$68,2,FALSE),\"\")","v":""}]
["Revisiedatum:","2026-03-20",null,null,130,"FBTO Zorgverzekering Basis","FBTO Zorgverzekeringen N.V.","130  FBTO Zorgverzekering Basis",130,null,5,{"$f":"IFERROR(VLOOKUP('Specifieke informatie A'!Q$72,Parameters!$H$2:$I$68,2,FALSE),\"\")","v":""}]
["Versie:",{"$f":"CONCATENATE(document_id,)","v":"JS2025ZVW.B"},null,null,27,"Interpolis ZorgActief ","Interpolis Zorgverzekeringen N.V.","27  Interpolis ZorgActief ",27,null,6,{"$f":"IFERROR(VLOOKUP('Specifieke informatie A'!S$72,Parameters!$H$2:$I$68,2,FALSE),\"\")","v":""}]
[null,null,null,null,113,"Interpolis ZorgCompact","Interpolis Zorgverzekeringen N.V.","113  Interpolis ZorgCompact",113]
[null,null,null,null,55,"Zilveren Kruis Basis Zeker","Zilveren Kruis Zorgverzekeringen N.V.","55  Zilveren Kruis Basis Zeker",55]
[null,null,null,null,66,"Zilveren Kruis Basis Exclusief","Zilveren Kruis Zorgverzekeringen N.V.","66  Zilveren Kruis Basis Exclusief",66]
["NUMMER_UO","NAAM_UO","FORMAT_UO1",null,85,"Zilveren Kruis Basis Budget","Zilveren Kruis Zorgverzekeringen N.V.","85  Zilveren Kruis Basis Budget",85]
["0000","KIES UW UZOVI-NUMMER",{"$f":"CONCATENATE(A13,\" \",B13)","v":"0000 KIES UW UZOVI-NUMMER"},null,91,"Pro Life Principe Polis (natura)","Zilveren Kruis Zorgverzekeringen N.V.","91  Pro Life Principe Polis (natura)",91]
["0101","UNIVÉ ZORG",{"$f":"CONCATENATE(A14,\" \",B14)","v":"0101 UNIVÉ ZORG"},null,114,"Pro Life Principe Polis Budget","Zilveren Kruis Zorgverzekeringen N.V.","114  Pro Life Principe Polis Budget",114]
["0104","CENTRALE ZORGVERZEKERINGEN NZV N.V.","0104 CENTRALE ZORGVERZEKERINGEN NZV N.V.",null,108,"ZieZo Basis","Zilveren Kruis Zorgverzekeringen N.V.","108  ZieZo Basis",108]
["0201","OHRA ZORGVERZEKERINGEN N.V.","0201 OHRA ZORGVERZEKERINGEN N.V.",null,83,"ik kies zelf van A.S.R. Vrije Keuze combinatie","ASR Basis Ziektekostenverzekeringen N.V.","83  ik kies zelf van A.S.R. Vrije Keuze combinatie",83]
["0403","ASR ","0403 ASR ",null,122,"ik kies zelf van A.S.R. Goede Keuze natura","ASR Basis Ziektekostenverzekeringen N.V.","122  ik kies zelf van A.S.R. Goede Keuze natura",122]
["0699","IZA","0699 IZA",null,96,"a.s.r. Eigen Keuze","ASR Basis Ziektekostenverzekeringen N.V.","96  a.s.r. Eigen Keuze",96]
["0736","UMC","0736 UMC",null,121,"a.s.r. Ruime Keuze","ASR Basis Ziektekostenverzekeringen N.V.","121  a.s.r. Ruime Keuze",121]
["3311","ZILVEREN KRUIS","3311 ZILVEREN KRUIS",null,19,"NN Zorgverzekering Combinatie","Centrale Ziektekostenverzekering NZV NV","19  NN Zorgverzekering Combinatie",19]
{"$rows_left_out":42}