{"text_format":"1","workbook":"xlsx","n_sheets":5,"sheets":["Hoofdmenu","Toelichting","NAW_gegevens","Verzekerden","Parameters"],"not_rendered":{"charts":0,"images":0,"macros":1,"external_links":0,"defined_names":80,"comments":0,"pivot_tables":0},"unopened":[],"bounds":{"document_bytes":16777216,"sheet_cells":100000,"rows_first":2000,"rows_last":500,"rows_between":2000,"halvings":0,"cell_chars":16384,"cell_head_chars":4096},"cells_cut":0,"cells_raw":0,"read":"whole","date_system":"1900"}

{"sheet":"Hoofdmenu","index":0,"n_rows":3,"n_cols":2,"rows_kept":3,"cut":false,"hidden":false,"merged":[[0,0,0,1],[1,0,1,1]]}
["HOOFDMENU"]
["OPGAVE VERZEKERDEN ZONDER BSN EN VERZEKERDEN ZONDER GEVERIFIEERD BSN 2023"]
["Navigatie","Afdrukken"]

{"sheet":"Toelichting","index":1,"n_rows":0,"n_cols":0,"rows_kept":0,"cut":false,"hidden":false,"merged":[[2,1,55,11]]}

{"sheet":"NAW_gegevens","index":2,"n_rows":13,"n_cols":2,"rows_kept":13,"cut":false,"hidden":false,"merged":[[2,0,2,1],[3,0,3,1]]}
[]
[]
["NAW-MENU"]
["OPGAVE VERZEKERDEN ZONDER BSN EN VERZEKERDEN ZONDER GEVERIFIEERD BSN 2023"]
[" Selecteer uw nummer:>","0000 KIES UW UZOVI-NUMMER"]
[" Uzovi-nummer:",{"$f":"MID(keuze_uzovi_nummer,1,4)","v":"0000"}]
[" Zorgverzekeraar:",{"$f":"LOOKUP(naw_uzovi_zorgverzekeraar,Parameters!A3:A23,Parameters!B3:B23)","v":"KIES UW UZOVI-NUMMER"}]
[" Plaats:",{"$f":"LOOKUP(naw_uzovi_zorgverzekeraar,Parameters!A3:A23,Parameters!D3:D23)","v":"PLAATS"}]
[" Contactpersoon:"]
[" Telefoonnummer:"]
[" E-mail:"]
[]
["N.B. Plaats is de statutaire vestigingsplaats zoals vastgelegd in het register van De Nederlandsche Bank"]

{"sheet":"Verzekerden","index":3,"n_rows":1401,"n_cols":14,"rows_kept":1401,"cut":false,"hidden":false,"merged":[[5,3,5,8],[6,3,6,8],[7,3,7,8],[8,3,8,8]]}
[]
[]
[null,null,"ZORGINSTITUUT NEDERLAND"]
[null,null,"Opgave verzekerden zonder BSN en verzekerden zonder geverifieerd BSN 2023",null,null,null,null,null,null,null,null,{"$f":"CONCATENATE(\"UZOVI: \",naw_uzovi_zorgverzekeraar)","v":"UZOVI: 0000"}]
[]
[null,null,null,"(aantal) detailrecords met verzekerden zonder BSN met totaal"]
[null,null,null,"(som) fracties verzekeringsperiode"]
[null,null,null,"(aantal) detailrecords met verzekerden zonder geverifieerd BSN met totaal"]
[null,null,null,"(som) fracties verzekeringsperiode"]
[]
[null,null,"Verzekerde","1= geen BSN          2= niet geverifieerd BSN","Postcode (4 cijfers)","Geboortejaar en -maand (JJJJMM)","Geslacht (1=man, 2=vrouw, 3=onbepaald)","Begindatum verzekering (JJJJMMDD)","Einddatum verzekering (JJJJMMDD)","Fractie verzekerde periode in 2023","Reden uitstroom Zvw","Motivatie","nummer DWH","Naam modelovereenkomst"]
[null,null,"Verzekerde 1",null,null,null,null,null,null,null,null,null,null,{"$f":"IFERROR(VLOOKUP(M12,Parameters!$G$4:$I$63,2,FALSE),\"\")","v":""}]
[null,null,"Verzekerde 2",null,null,null,null,null,null,null,null,null,null,{"$f":"IFERROR(VLOOKUP(M13,Parameters!$G$4:$I$63,2,FALSE),\"\")","v":""}]
[null,null,"Verzekerde 3",null,null,null,null,null,null,null,null,null,null,{"$f":"IFERROR(VLOOKUP(M14,Parameters!$G$4:$I$63,2,FALSE),\"\")","v":""}]
[null,null,"Verzekerde 4",null,null,null,null,null,null,null,null,null,null,{"$f":"IFERROR(VLOOKUP(M15,Parameters!$G$4:$I$63,2,FALSE),\"\")","v":""}]
[null,null,"Verzekerde 5",null,null,null,null,null,null,null,null,null,null,{"$f":"IFERROR(VLOOKUP(M16,Parameters!$G$4:$I$63,2,FALSE),\"\")","v":""}]
[null,null,"Verzekerde 6",null,null,null,null,null,null,null,null,null,null,{"$f":"IFERROR(VLOOKUP(M17,Parameters!$G$4:$I$63,2,FALSE),\"\")","v":""}]
[null,null,"Verzekerde 7",null,null,null,null,null,null,null,null,null,null,{"$f":"IFERROR(VLOOKUP(M18,Parameters!$G$4:$I$63,2,FALSE),\"\")","v":""}]
[null,null,"Verzekerde 8",null,null,null,null,null,null,null,null,null,null,{"$f":"IFERROR(VLOOKUP(M19,Parameters!$G$4:$I$63,2,FALSE),\"\")","v":""}]
[null,null,"Verzekerde 9",null,null,null,null,null,null,null,null,null,null,{"$f":"IFERROR(VLOOKUP(M20,Parameters!$G$4:$I$63,2,FALSE),\"\")","v":""}]
[null,null,"Verzekerde 10",null,null,null,null,null,null,null,null,null,null,{"$f":"IFERROR(VLOOKUP(M21,Parameters!$G$4:$I$63,2,FALSE),\"\")","v":""}]
[null,null,"Verzekerde 11",null,null,null,null,null,null,null,null,null,null,{"$f":"IFERROR(VLOOKUP(M22,Parameters!$G$4:$I$63,2,FALSE),\"\")","v":""}]
[null,null,"Verzekerde 12",null,null,null,null,null,null,null,null,null,null,{"$f":"IFERROR(VLOOKUP(M23,Parameters!$G$4:$I$63,2,FALSE),\"\")","v":""}]
[null,null,"Verzekerde 13",null,null,null,null,null,null,null,null,null,null,{"$f":"IFERROR(VLOOKUP(M24,Parameters!$G$4:$I$63,2,FALSE),\"\")","v":""}]
[null,null,"Verzekerde 14",null,null,null,null,null,null,null,null,null,null,{"$f":"IFERROR(VLOOKUP(M25,Parameters!$G$4:$I$63,2,FALSE),\"\")","v":""}]
[null,null,"Verzekerde 15",null,null,null,null,null,null,null,null,null,null,{"$f":"IFERROR(VLOOKUP(M26,Parameters!$G$4:$I$63,2,FALSE),\"\")","v":""}]
[null,null,"Verzekerde 16",null,null,null,null,null,null,null,null,null,null,{"$f":"IFERROR(VLOOKUP(M27,Parameters!$G$4:$I$63,2,FALSE),\"\")","v":""}]
[null,null,"Verzekerde 17",null,null,null,null,null,null,null,null,null,null,{"$f":"IFERROR(VLOOKUP(M28,Parameters!$G$4:$I$63,2,FALSE),\"\")","v":""}]
[null,null,"Verzekerde 18",null,null,null,null,null,null,null,null,null,null,{"$f":"IFERROR(VLOOKUP(M29,Parameters!$G$4:$I$63,2,FALSE),\"\")","v":""}]
[null,null,"Verzekerde 19",null,null,null,null,null,null,null,null,null,null,{"$f":"IFERROR(VLOOKUP(M30,Parameters!$G$4:$I$63,2,FALSE),\"\")","v":""}]
[null,null,"Verzekerde 20",null,null,null,null,null,null,null,null,null,null,{"$f":"IFERROR(VLOOKUP(M31,Parameters!$G$4:$I$63,2,FALSE),\"\")","v":""}]
[null,null,"Verzekerde 21",null,null,null,null,null,null,null,null,null,null,{"$f":"IFERROR(VLOOKUP(M32,Parameters!$G$4:$I$63,2,FALSE),\"\")","v":""}]
[null,null,"Verzekerde 22",null,null,null,null,null,null,null,null,null,null,{"$f":"IFERROR(VLOOKUP(M33,Parameters!$G$4:$I$63,2,FALSE),\"\")","v":""}]
[null,null,"Verzekerde 23",null,null,null,null,null,null,null,null,null,null,{"$f":"IFERROR(VLOOKUP(M34,Parameters!$G$4:$I$63,2,FALSE),\"\")","v":""}]
[null,null,"Verzekerde 24",null,null,null,null,null,null,null,null,null,null,{"$f":"IFERROR(VLOOKUP(M35,Parameters!$G$4:$I$63,2,FALSE),\"\")","v":""}]
[null,null,"Verzekerde 25",null,null,null,null,null,null,null,null,null,null,{"$f":"IFERROR(VLOOKUP(M36,Parameters!$G$4:$I$63,2,FALSE),\"\")","v":""}]
[null,null,"Verzekerde 26",null,null,null,null,null,null,null,null,null,null,{"$f":"IFERROR(VLOOKUP(M37,Parameters!$G$4:$I$63,2,FALSE),\"\")","v":""}]
[null,null,"Verzekerde 27",null,null,null,null,null,null,null,null,null,null,{"$f":"IFERROR(VLOOKUP(M38,Parameters!$G$4:$I$63,2,FALSE),\"\")","v":""}]
[null,null,"Verzekerde 28",null,null,null,null,null,null,null,null,null,null,{"$f":"IFERROR(VLOOKUP(M39,Parameters!$G$4:$I$63,2,FALSE),\"\")","v":""}]
[null,null,"Verzekerde 29",null,null,null,null,null,null,null,null,null,null,{"$f":"IFERROR(VLOOKUP(M40,Parameters!$G$4:$I$63,2,FALSE),\"\")","v":""}]
[null,null,"Verzekerde 30",null,null,null,null,null,null,null,null,null,null,{"$f":"IFERROR(VLOOKUP(M41,Parameters!$G$4:$I$63,2,FALSE),\"\")","v":""}]
[null,null,"Verzekerde 31",null,null,null,null,null,null,null,null,null,null,{"$f":"IFERROR(VLOOKUP(M42,Parameters!$G$4:$I$63,2,FALSE),\"\")","v":""}]
[null,null,"Verzekerde 32",null,null,null,null,null,null,null,null,null,null,{"$f":"IFERROR(VLOOKUP(M43,Parameters!$G$4:$I$63,2,FALSE),\"\")","v":""}]
[null,null,"Verzekerde 33",null,null,null,null,null,null,null,null,null,null,{"$f":"IFERROR(VLOOKUP(M44,Parameters!$G$4:$I$63,2,FALSE),\"\")","v":""}]
[null,null,"Verzekerde 34",null,null,null,null,null,null,null,null,null,null,{"$f":"IFERROR(VLOOKUP(M45,Parameters!$G$4:$I$63,2,FALSE),\"\")","v":""}]
[null,null,"Verzekerde 35",null,null,null,null,null,null,null,null,null,null,{"$f":"IFERROR(VLOOKUP(M46,Parameters!$G$4:$I$63,2,FALSE),\"\")","v":""}]
[null,null,"Verzekerde 36",null,null,null,null,null,null,null,null,null,null,{"$f":"IFERROR(VLOOKUP(M47,Parameters!$G$4:$I$63,2,FALSE),\"\")","v":""}]
[null,null,"Verzekerde 37",null,null,null,null,null,null,null,null,null,null,{"$f":"IFERROR(VLOOKUP(M48,Parameters!$G$4:$I$63,2,FALSE),\"\")","v":""}]
[null,null,"Verzekerde 38",null,null,null,null,null,null,null,null,null,null,{"$f":"IFERROR(VLOOKUP(M49,Parameters!$G$4:$I$63,2,FALSE),\"\")","v":""}]
[null,null,"Verzekerde 39",null,null,null,null,null,null,null,null,null,null,{"$f":"IFERROR(VLOOKUP(M50,Parameters!$G$4:$I$63,2,FALSE),\"\")","v":""}]
[null,null,"Verzekerde 40",null,null,null,null,null,null,null,null,null,null,{"$f":"IFERROR(VLOOKUP(M51,Parameters!$G$4:$I$63,2,FALSE),\"\")","v":""}]
[null,null,"Verzekerde 41",null,null,null,null,null,null,null,null,null,null,{"$f":"IFERROR(VLOOKUP(M52,Parameters!$G$4:$I$63,2,FALSE),\"\")","v":""}]
[null,null,"Verzekerde 42",null,null,null,null,null,null,null,null,null,null,{"$f":"IFERROR(VLOOKUP(M53,Parameters!$G$4:$I$63,2,FALSE),\"\")","v":""}]
[null,null,"Verzekerde 43",null,null,null,null,null,null,null,null,null,null,{"$f":"IFERROR(VLOOKUP(M54,Parameters!$G$4:$I$63,2,FALSE),\"\")","v":""}]
[null,null,"Verzekerde 44",null,null,null,null,null,null,null,null,null,null,{"$f":"IFERROR(VLOOKUP(M55,Parameters!$G$4:$I$63,2,FALSE),\"\")","v":""}]
[null,null,"Verzekerde 45",null,null,null,null,null,null,null,null,null,null,{"$f":"IFERROR(VLOOKUP(M56,Parameters!$G$4:$I$63,2,FALSE),\"\")","v":""}]
[null,null,"Verzekerde 46",null,null,null,null,null,null,null,null,null,null,{"$f":"IFERROR(VLOOKUP(M57,Parameters!$G$4:$I$63,2,FALSE),\"\")","v":""}]
[null,null,"Verzekerde 47",null,null,null,null,null,null,null,null,null,null,{"$f":"IFERROR(VLOOKUP(M58,Parameters!$G$4:$I$63,2,FALSE),\"\")","v":""}]
[null,null,"Verzekerde 48",null,null,null,null,null,null,null,null,null,null,{"$f":"IFERROR(VLOOKUP(M59,Parameters!$G$4:$I$63,2,FALSE),\"\")","v":""}]
[null,null,"Verzekerde 49",null,null,null,null,null,null,null,null,null,null,{"$f":"IFERROR(VLOOKUP(M60,Parameters!$G$4:$I$63,2,FALSE),\"\")","v":""}]
[null,null,"Verzekerde 50",null,null,null,null,null,null,null,null,null,null,{"$f":"IFERROR(VLOOKUP(M61,Parameters!$G$4:$I$63,2,FALSE),\"\")","v":""}]
[null,null,"Verzekerde 51",null,null,null,null,null,null,null,null,null,null,{"$f":"IFERROR(VLOOKUP(M62,Parameters!$G$4:$I$63,2,FALSE),\"\")","v":""}]
[null,null,"Verzekerde 52",null,null,null,null,null,null,null,null,null,null,{"$f":"IFERROR(VLOOKUP(M63,Parameters!$G$4:$I$63,2,FALSE),\"\")","v":""}]
[null,null,"Verzekerde 53",null,null,null,null,null,null,null,null,null,null,{"$f":"IFERROR(VLOOKUP(M64,Parameters!$G$4:$I$63,2,FALSE),\"\")","v":""}]
[null,null,"Verzekerde 54",null,null,null,null,null,null,null,null,null,null,{"$f":"IFERROR(VLOOKUP(M65,Parameters!$G$4:$I$63,2,FALSE),\"\")","v":""}]
[null,null,"Verzekerde 55",null,null,null,null,null,null,null,null,null,null,{"$f":"IFERROR(VLOOKUP(M66,Parameters!$G$4:$I$63,2,FALSE),\"\")","v":""}]
[null,null,"Verzekerde 56",null,null,null,null,null,null,null,null,null,null,{"$f":"IFERROR(VLOOKUP(M67,Parameters!$G$4:$I$63,2,FALSE),\"\")","v":""}]
[null,null,"Verzekerde 57",null,null,null,null,null,null,null,null,null,null,{"$f":"IFERROR(VLOOKUP(M68,Parameters!$G$4:$I$63,2,FALSE),\"\")","v":""}]
[null,null,"Verzekerde 58",null,null,null,null,null,null,null,null,null,null,{"$f":"IFERROR(VLOOKUP(M69,Parameters!$G$4:$I$63,2,FALSE),\"\")","v":""}]
[null,null,"Verzekerde 59",null,null,null,null,null,null,null,null,null,null,{"$f":"IFERROR(VLOOKUP(M70,Parameters!$G$4:$I$63,2,FALSE),\"\")","v":""}]
[null,null,"Verzekerde 60",null,null,null,null,null,null,null,null,null,null,{"$f":"IFERROR(VLOOKUP(M71,Parameters!$G$4:$I$63,2,FALSE),\"\")","v":""}]
[null,null,"Verzekerde 61",null,null,null,null,null,null,null,null,null,null,{"$f":"IFERROR(VLOOKUP(M72,Parameters!$G$4:$I$63,2,FALSE),\"\")","v":""}]
[null,null,"Verzekerde 62",null,null,null,null,null,null,null,null,null,null,{"$f":"IFERROR(VLOOKUP(M73,Parameters!$G$4:$I$63,2,FALSE),\"\")","v":""}]
[null,null,"Verzekerde 63",null,null,null,null,null,null,null,null,null,null,{"$f":"IFERROR(VLOOKUP(M74,Parameters!$G$4:$I$63,2,FALSE),\"\")","v":""}]
[null,null,"Verzekerde 64",null,null,null,null,null,null,null,null,null,null,{"$f":"IFERROR(VLOOKUP(M75,Parameters!$G$4:$I$63,2,FALSE),\"\")","v":""}]
[null,null,"Verzekerde 65",null,null,null,null,null,null,null,null,null,null,{"$f":"IFERROR(VLOOKUP(M76,Parameters!$G$4:$I$63,2,FALSE),\"\")","v":""}]
[null,null,"Verzekerde 66",null,null,null,null,null,null,null,null,null,null,{"$f":"IFERROR(VLOOKUP(M77,Parameters!$G$4:$I$63,2,FALSE),\"\")","v":""}]
[null,null,"Verzekerde 67",null,null,null,null,null,null,null,null,null,null,{"$f":"IFERROR(VLOOKUP(M78,Parameters!$G$4:$I$63,2,FALSE),\"\")","v":""}]
[null,null,"Verzekerde 68",null,null,null,null,null,null,null,null,null,null,{"$f":"IFERROR(VLOOKUP(M79,Parameters!$G$4:$I$63,2,FALSE),\"\")","v":""}]
[null,null,"Verzekerde 69",null,null,null,null,null,null,null,null,null,null,{"$f":"IFERROR(VLOOKUP(M80,Parameters!$G$4:$I$63,2,FALSE),\"\")","v":""}]
{"$rows_left_out":1322}
{"sheet":"Parameters","index":4,"n_rows":63,"n_cols":9,"rows_kept":63,"cut":false,"hidden":true,"merged":[]}
[]
["NUMMER_ZK","NAAM_ZK","FORMAT_ZK1","PLAATS",null,null,"Alle mogelijke modelovereenkomsten 2023 waaruit gekozen kan worden"]
["0000","KIES UW UZOVI-NUMMER",{"$f":"CONCATENATE(A3,\" \",B3)","v":"0000 KIES UW UZOVI-NUMMER"},"PLAATS",null,null,"nummer DWH","Naam modelovereenkomst","verzekeraar"]
["0101","N.V. UNIVÉ ZORG","0101 N.V. UNIVÉ ZORG","ARNHEM",null,null,5,"Anderzorg Basis","AnderZorg N.V."]
["0104","CENTRALE ZIEKTEKOSTENVERZEKERING NZV N.V.","0104 CENTRALE ZIEKTEKOSTENVERZEKERING NZV N.V.","TILBURG",null,null,14,"CZ Zorg op maatpolis (Natura)","CZ Zorgverzekeringen N.V."]
["0201","OHRA ZIEKTEKOSTENVERZEKERINGEN N.V.","0201 OHRA ZIEKTEKOSTENVERZEKERINGEN N.V.","TILBURG",null,null,15,"CZ Zorgkeuzepolis (Restitutie)","CZ Zorgverzekeringen N.V."]
["0403","ASR BASIS ZIEKTEKOSTENVERZEKERINGEN N.V.","0403 ASR BASIS ZIEKTEKOSTENVERZEKERINGEN N.V.","UTRECHT",null,null,19,"NN Zorgverzekering Combinatie","Centrale Ziektekostenverzekering NZV NV"]
["0699","IZA ZORGVERZEKERAAR N.V.","0699 IZA ZORGVERZEKERAAR N.V.","ARNHEM",null,null,20,"DSW polisvoorwaarden","OWM DSW Zorgverzekeraar U.A."]
["0736","N.V. ZORGVERZEKERAAR UMC","0736 N.V. ZORGVERZEKERAAR UMC","ARNHEM",null,null,27,"Interpolis ZorgActief ","Interpolis Zorgverzekeringen N.V."]
["3311","ZILVEREN KRUIS ZORGVERZEKERINGEN N.V.","3311 ZILVEREN KRUIS ZORGVERZEKERINGEN N.V.","HENGELO OV",null,null,31,"Menzis Basis","Menzis Zorgverzekeraar N.V."]
["3313","INTERPOLIS ZORGVERZEKERINGEN N.V.","3313 INTERPOLIS ZORGVERZEKERINGEN N.V.","LEIDEN",null,null,32,"Menzis Basis Vrij","Menzis Zorgverzekeraar N.V."]
["3332","MENZIS ZORGVERZEKERAAR N.V.",{"$f":"CONCATENATE(A12,\" \",B12)","v":"3332 MENZIS ZORGVERZEKERAAR N.V."},"WAGENINGEN",null,null,33,"OHRA Zorgverzekering Combinatie","OHRA Zorgverzekeringen N.V."]
["3333","ANDERZORG N.V.",{"$f":"CONCATENATE(A13,\" \",B13)","v":"3333 ANDERZORG N.V."},"GRONINGEN",null,null,39,"ONVZ Vrije Keuze Basisverzekering","ONVZ Ziektekostenverzekeraar N.V."]
["3343","ONVZ ZIEKTEKOSTENVERZEKERAAR N.V.",{"$f":"CONCATENATE(A14,\" \",B14)","v":"3343 ONVZ ZIEKTEKOSTENVERZEKERAAR N.V."},"HOUTEN",null,null,42,"Salland Basisverzekering","Eno Zorgverzekeraar N.V."]
["3347","SALLAND ZORGVERZEKERAAR N.V.","3347 SALLAND ZORGVERZEKERAAR N.V.","DEVENTER",null,null,44,"Stad Holland polisvoorwaarden","OWM Stad Holland Zorgverzekeraar U.A."]
["3351","FBTO ZORGVERZEKERINGEN N.V.",{"$f":"CONCATENATE(A16,\" \",B16)","v":"3351 FBTO ZORGVERZEKERINGEN N.V."},"LEEUWARDEN",null,null,47,"UMC Eigen Keuze","N.V. Zorgverzekeraar UMC"]
["3358","DE FRIESLAND","3358 DE FRIESLAND","LEEUWARDEN",null,null,50,"Univé Zorg Geregeld polis ","N.V. Univé Zorg"]
["3359","EUCARE INSURANCE PCC LTD","3359 EUCARE INSURANCE PCC LTD","TA' XBIEX",null,null,51,"Univé Zorg Vrij polis ","N.V. Univé Zorg"]
["7029","OWM ZORGVERZEKERAAR 'DSW' U.A.","7029 OWM ZORGVERZEKERAAR 'DSW' U.A.","SCHIEDAM",null,null,53,"VGZ Ruime Keuze","VGZ Zorgverzekeraar N.V."]
["7037","STAD HOLLAND ZORGVERZEKERAAR OWM U.A.","7037 STAD HOLLAND ZORGVERZEKERAAR OWM U.A.","SCHIEDAM",null,null,54,"VGZ Eigen Keuze","VGZ Zorgverzekeraar N.V."]
["7085","OWM ZORGVERZEKERAAR ZORG EN ZEKERHEID U.A.","7085 OWM ZORGVERZEKERAAR ZORG EN ZEKERHEID U.A.","LEIDEN",null,null,55,"Zilveren Kruis Basis Zeker","Zilveren Kruis Zorgverzekeringen N.V."]
["7095","VGZ ZORGVERZEKERAAR N.V.","7095 VGZ ZORGVERZEKERAAR N.V.","ARNHEM",null,null,57,"Zorg en Zekerheid Zorg Vrij Polis","OWM Zorgverzekeraar Zorg en Zekerheid U.A."]
["7119","OWM CENTRALE ZORGVERZEKERAARS GROEP, ZORGVERZEKERAAR U.A.","7119 OWM CENTRALE ZORGVERZEKERAARS GROEP, ZORGVERZEKERAAR U.A.","TILBURG",null,null,58,"Zorg en Zekerheid Zorg Zeker Polis","OWM Zorgverzekeraar Zorg en Zekerheid U.A."]
[null,null,null,null,null,null,65,"Univé Gewoon ZEKUR Zorg","N.V. Univé Zorg"]
[null,null,null,null,null,null,66,"Zilveren Kruis Basis Exclusief","Zilveren Kruis Zorgverzekeringen N.V."]
[null,null,null,null,null,null,73,"CZdirect (Natura)","CZ Zorgverzekeringen N.V."]
[null,null,null,null,null,null,74,"IZA Eigen Keuze","IZA Zorgverzekeraar N.V."]
[null,null,null,null,null,null,80,"De Friesland Alles Verzorgd Polis","De Friesland Zorgverzekeraar N.V."]
[null,null,null,null,null,null,82,"VGZ Bewuzt Basis","VGZ Zorgverzekeraar N.V."]
[null,null,null,null,null,null,83,"ik kies zelf van A.S.R. Vrije Keuze combinatie","ASR Basis Ziektekostenverzekeringen N.V."]
[null,null,null,null,null,null,84,"Zorg en Zekerheid Zorg Gemak Polis","OWM Zorgverzekeraar Zorg en Zekerheid U.A."]
[null,null,null,null,null,null,85,"Zilveren Kruis Basis Budget","Zilveren Kruis Zorgverzekeringen N.V."]
[null,null,null,null,null,null,91,"Pro Life Principe Polis (natura)","Zilveren Kruis Zorgverzekeringen N.V."]
[null,null,null,null,null,null,96,"a.s.r. Eigen Keuze","ASR Basis Ziektekostenverzekeringen N.V."]
[null,null,null,null,null,null,97,"CZ Zorgbewustpolis (Natura)","CZ Zorgverzekeringen N.V."]
[null,null,null,null,null,null,98,"IZA Ruime Keuze","IZA Zorgverzekeraar N.V."]
[null,null,null,null,null,null,102,"Hema Basisverzekering","Menzis Zorgverzekeraar N.V."]
[null,null,null,null,null,null,103,"Menzis Basis Voordelig","Menzis Zorgverzekeraar N.V."]
[null,null,null,null,null,null,104,"FBTO Zorgverzekering Basis Plus","FBTO Zorgverzekeringen N.V."]
[null,null,null,null,null,null,105,"FBTO Zorgverzekering Basis Vrij","FBTO Zorgverzekeringen N.V."]
[null,null,null,null,null,null,107,"Univé Zorg Select Polis","N.V. Univé Zorg"]
[null,null,null,null,null,null,108,"ZieZo Basis","Zilveren Kruis Zorgverzekeringen N.V."]
[null,null,null,null,null,null,109,"De Friesland Zelf Bewust Polis","De Friesland Zorgverzekeraar N.V."]
[null,null,null,null,null,null,110,"HollandZorg Basisverzekering","Eno Zorgverzekeraar N.V."]
[null,null,null,null,null,null,113,"Interpolis ZorgCompact","Interpolis Zorgverzekeringen N.V."]
[null,null,null,null,null,null,114,"Pro Life Principe Polis Budget","Zilveren Kruis Zorgverzekeringen N.V."]
[null,null,null,null,null,null,115,"Basisverzekering Natura","EUCARE Insurance PCC Limited"]
[null,null,null,null,null,null,116,"Basisverzekering Restitutie","EUCARE Insurance PCC Limited"]
[null,null,null,null,null,null,118,"Basisverzekering Bewust Verzekerd","EUCARE Insurance PCC Limited"]
[null,null,null,null,null,null,121,"a.s.r. Ruime Keuze","ASR Basis Ziektekostenverzekeringen N.V."]
[null,null,null,null,null,null,122,"ik kies zelf van A.S.R. Goede Keuze natura","ASR Basis Ziektekostenverzekeringen N.V."]
[null,null,null,null,null,null,123,"CZ Just Basic (Natura Just)","CZ Zorgverzekeringen N.V."]
[null,null,null,null,null,null,124,"VGZ Basis Keuze","VGZ Zorgverzekeraar N.V."]
[null,null,null,null,null,null,125,"UMC Ruime Keuze","N.V. Zorgverzekeraar UMC"]
[null,null,null,null,null,null,126,"Basisverzekering Natura Select","EUCARE Insurance PCC Limited"]
[null,null,null,null,null,null,127,"Jaaah basis","ONVZ Ziektekostenverzekeraar N.V."]
[null,null,null,null,null,null,128,"IZA Basis Keuze","IZA Zorgverzekeraar N.V."]
[null,null,null,null,null,null,130,"FBTO Zorgverzekering Basis","FBTO Zorgverzekeringen N.V."]
[null,null,null,null,null,null,131,"ZEM Polis","OWM Zorgverzekeraar Zorg en Zekerheid U.A."]
[null,null,null,null,null,null,132,"VinkVink Basisverzekering","Menzis Zorgverzekeraar N.V."]
[null,null,null,null,null,null,133,"NN Zorgverzekering Natura (Zorg Voordelig) ","Centrale Ziektekostenverzekering NZV NV"]
[null,null,null,null,null,null,134,"Basisverzekering Bewust Verzekerd Restitutie ","EUCARE Insurance PCC Limited"]
[null,null,null,null,null,null,136,"Univé Zorg Basis Natura ","N.V. Univé Zorg"]