{"text_format":"1","workbook":"xlsx","n_sheets":5,"sheets":["Hoofdmenu","Toelichting","NAW_gegevens","Verzekerden","Parameters"],"not_rendered":{"charts":0,"images":0,"macros":1,"external_links":0,"defined_names":80,"comments":0,"pivot_tables":0},"unopened":[],"bounds":{"document_bytes":16777216,"sheet_cells":100000,"rows_first":2000,"rows_last":500,"rows_between":2000,"halvings":0,"cell_chars":16384,"cell_head_chars":4096},"cells_cut":0,"cells_raw":0,"read":"whole","date_system":"1900"}

{"sheet":"Hoofdmenu","index":0,"n_rows":3,"n_cols":2,"rows_kept":3,"cut":false,"hidden":false,"merged":[[0,0,0,1],[1,0,1,1]]}
["HOOFDMENU"]
["OPGAVE VERZEKERDEN ZONDER BSN EN VERZEKERDEN ZONDER GEVERIFIEERD BSN 2024"]
["Navigatie","Afdrukken"]

{"sheet":"Toelichting","index":1,"n_rows":0,"n_cols":0,"rows_kept":0,"cut":false,"hidden":false,"merged":[[2,1,55,11]]}

{"sheet":"NAW_gegevens","index":2,"n_rows":13,"n_cols":2,"rows_kept":13,"cut":false,"hidden":false,"merged":[[2,0,2,1],[3,0,3,1]]}
[]
[]
["NAW-MENU"]
["OPGAVE VERZEKERDEN ZONDER BSN EN VERZEKERDEN ZONDER GEVERIFIEERD BSN 2024"]
[" Selecteer uw nummer:>","0000 KIES UW UZOVI-NUMMER"]
[" Uzovi-nummer:",{"$f":"MID(keuze_uzovi_nummer,1,4)","v":"0000"}]
[" Zorgverzekeraar:",{"$f":"LOOKUP(naw_uzovi_zorgverzekeraar,Parameters!A3:A23,Parameters!B3:B23)","v":"KIES UW UZOVI-NUMMER"}]
[" Plaats:",{"$f":"LOOKUP(naw_uzovi_zorgverzekeraar,Parameters!A3:A23,Parameters!D3:D23)","v":"PLAATS"}]
[" Contactpersoon:"]
[" Telefoonnummer:"]
[" E-mail:"]
[]
["N.B. Plaats is de statutaire vestigingsplaats zoals vastgelegd in het register van De Nederlandsche Bank"]

{"sheet":"Verzekerden","index":3,"n_rows":1402,"n_cols":13,"rows_kept":1402,"cut":false,"hidden":false,"merged":[[6,3,6,9],[7,3,7,9],[8,3,8,9],[9,3,9,9]]}
[]
[]
[null,null,"ZORGINSTITUUT NEDERLAND"]
[null,null,"Verzekerde periode en persoonskenmerken, tweede deelbestand:  verzekerden zonder BSN en verzekerden zonder geverifieerd BSN ",null,null,null,null,null,null,null,null,null,{"$f":"CONCATENATE(\"UZOVI: \",naw_uzovi_zorgverzekeraar)","v":"UZOVI: 0000"}]
[]
[null,null,"Format verzekerden zonder BSN"]
[null,null,null,"(aantal) detailrecords met verzekerden zonder BSN "]
[null,null,null,"(som) fracties verzekeringsperiode"]
[null,null,null,"(aantal) detailrecords met verzekerden zonder geverifieerd BSN "]
[null,null,null,"(som) fracties verzekeringsperiode"]
[]
[null,null,"Verzekerde","1= geen BSN          2= niet geverifieerd BSN","Postcode (4 cijfers)","Postcode adres Basisregistratie Personen (4 cijfers) ","Geboortejaar en -maand (JJJJMM)","Geslacht (1=man, 2=vrouw, 3=onbepaald)","Begindatum verzekering (JJJJMMDD)","Einddatum verzekering (JJJJMMDD)","Fractie verzekerde periode in 2024","Reden uitstroom Zvw","Motivatie"]
[null,null,"Verzekerde 1"]
[null,null,"Verzekerde 2"]
[null,null,"Verzekerde 3"]
[null,null,"Verzekerde 4"]
[null,null,"Verzekerde 5"]
[null,null,"Verzekerde 6"]
[null,null,"Verzekerde 7"]
[null,null,"Verzekerde 8"]
[null,null,"Verzekerde 9"]
[null,null,"Verzekerde 10"]
[null,null,"Verzekerde 11"]
[null,null,"Verzekerde 12"]
[null,null,"Verzekerde 13"]
[null,null,"Verzekerde 14"]
[null,null,"Verzekerde 15"]
[null,null,"Verzekerde 16"]
[null,null,"Verzekerde 17"]
[null,null,"Verzekerde 18"]
[null,null,"Verzekerde 19"]
[null,null,"Verzekerde 20"]
[null,null,"Verzekerde 21"]
[null,null,"Verzekerde 22"]
[null,null,"Verzekerde 23"]
[null,null,"Verzekerde 24"]
[null,null,"Verzekerde 25"]
[null,null,"Verzekerde 26"]
[null,null,"Verzekerde 27"]
[null,null,"Verzekerde 28"]
[null,null,"Verzekerde 29"]
[null,null,"Verzekerde 30"]
[null,null,"Verzekerde 31"]
[null,null,"Verzekerde 32"]
[null,null,"Verzekerde 33"]
[null,null,"Verzekerde 34"]
[null,null,"Verzekerde 35"]
[null,null,"Verzekerde 36"]
[null,null,"Verzekerde 37"]
[null,null,"Verzekerde 38"]
[null,null,"Verzekerde 39"]
[null,null,"Verzekerde 40"]
[null,null,"Verzekerde 41"]
[null,null,"Verzekerde 42"]
[null,null,"Verzekerde 43"]
[null,null,"Verzekerde 44"]
[null,null,"Verzekerde 45"]
[null,null,"Verzekerde 46"]
[null,null,"Verzekerde 47"]
[null,null,"Verzekerde 48"]
[null,null,"Verzekerde 49"]
[null,null,"Verzekerde 50"]
[null,null,"Verzekerde 51"]
[null,null,"Verzekerde 52"]
[null,null,"Verzekerde 53"]
[null,null,"Verzekerde 54"]
[null,null,"Verzekerde 55"]
[null,null,"Verzekerde 56"]
[null,null,"Verzekerde 57"]
[null,null,"Verzekerde 58"]
[null,null,"Verzekerde 59"]
[null,null,"Verzekerde 60"]
[null,null,"Verzekerde 61"]
[null,null,"Verzekerde 62"]
[null,null,"Verzekerde 63"]
[null,null,"Verzekerde 64"]
[null,null,"Verzekerde 65"]
[null,null,"Verzekerde 66"]
[null,null,"Verzekerde 67"]
[null,null,"Verzekerde 68"]
[null,null,"Verzekerde 69"]
[null,null,"Verzekerde 70"]
[null,null,"Verzekerde 71"]
[null,null,"Verzekerde 72"]
[null,null,"Verzekerde 73"]
[null,null,"Verzekerde 74"]
[null,null,"Verzekerde 75"]
[null,null,"Verzekerde 76"]
[null,null,"Verzekerde 77"]
[null,null,"Verzekerde 78"]
[null,null,"Verzekerde 79"]
[null,null,"Verzekerde 80"]
[null,null,"Verzekerde 81"]
[null,null,"Verzekerde 82"]
[null,null,"Verzekerde 83"]
[null,null,"Verzekerde 84"]
[null,null,"Verzekerde 85"]
[null,null,"Verzekerde 86"]
[null,null,"Verzekerde 87"]
[null,null,"Verzekerde 88"]
[null,null,"Verzekerde 89"]
[null,null,"Verzekerde 90"]
[null,null,"Verzekerde 91"]
[null,null,"Verzekerde 92"]
[null,null,"Verzekerde 93"]
[null,null,"Verzekerde 94"]
[null,null,"Verzekerde 95"]
[null,null,"Verzekerde 96"]
[null,null,"Verzekerde 97"]
[null,null,"Verzekerde 98"]
[null,null,"Verzekerde 99"]
[null,null,"Verzekerde 100"]
[null,null,"Verzekerde 101"]
[null,null,"Verzekerde 102"]
[null,null,"Verzekerde 103"]
[null,null,"Verzekerde 104"]
[null,null,"Verzekerde 105"]
[null,null,"Verzekerde 106"]
[null,null,"Verzekerde 107"]
[null,null,"Verzekerde 108"]
[null,null,"Verzekerde 109"]
[null,null,"Verzekerde 110"]
[null,null,"Verzekerde 111"]
[null,null,"Verzekerde 112"]
[null,null,"Verzekerde 113"]
[null,null,"Verzekerde 114"]
[null,null,"Verzekerde 115"]
[null,null,"Verzekerde 116"]
[null,null,"Verzekerde 117"]
[null,null,"Verzekerde 118"]
[null,null,"Verzekerde 119"]
[null,null,"Verzekerde 120"]
[null,null,"Verzekerde 121"]
[null,null,"Verzekerde 122"]
[null,null,"Verzekerde 123"]
[null,null,"Verzekerde 124"]
[null,null,"Verzekerde 125"]
[null,null,"Verzekerde 126"]
[null,null,"Verzekerde 127"]
[null,null,"Verzekerde 128"]
[null,null,"Verzekerde 129"]
[null,null,"Verzekerde 130"]
[null,null,"Verzekerde 131"]
[null,null,"Verzekerde 132"]
[null,null,"Verzekerde 133"]
[null,null,"Verzekerde 134"]
[null,null,"Verzekerde 135"]
[null,null,"Verzekerde 136"]
[null,null,"Verzekerde 137"]
[null,null,"Verzekerde 138"]
[null,null,"Verzekerde 139"]
[null,null,"Verzekerde 140"]
[null,null,"Verzekerde 141"]
[null,null,"Verzekerde 142"]
[null,null,"Verzekerde 143"]
[null,null,"Verzekerde 144"]
[null,null,"Verzekerde 145"]
[null,null,"Verzekerde 146"]
[null,null,"Verzekerde 147"]
[null,null,"Verzekerde 148"]
[null,null,"Verzekerde 149"]
[null,null,"Verzekerde 150"]
[null,null,"Verzekerde 151"]
[null,null,"Verzekerde 152"]
[null,null,"Verzekerde 153"]
[null,null,"Verzekerde 154"]
[null,null,"Verzekerde 155"]
[null,null,"Verzekerde 156"]
[null,null,"Verzekerde 157"]
[null,null,"Verzekerde 158"]
[null,null,"Verzekerde 159"]
[null,null,"Verzekerde 160"]
[null,null,"Verzekerde 161"]
[null,null,"Verzekerde 162"]
[null,null,"Verzekerde 163"]
[null,null,"Verzekerde 164"]
[null,null,"Verzekerde 165"]
[null,null,"Verzekerde 166"]
[null,null,"Verzekerde 167"]
[null,null,"Verzekerde 168"]
[null,null,"Verzekerde 169"]
[null,null,"Verzekerde 170"]
[null,null,"Verzekerde 171"]
[null,null,"Verzekerde 172"]
[null,null,"Verzekerde 173"]
[null,null,"Verzekerde 174"]
[null,null,"Verzekerde 175"]
[null,null,"Verzekerde 176"]
[null,null,"Verzekerde 177"]
[null,null,"Verzekerde 178"]
[null,null,"Verzekerde 179"]
[null,null,"Verzekerde 180"]
[null,null,"Verzekerde 181"]
[null,null,"Verzekerde 182"]
[null,null,"Verzekerde 183"]
[null,null,"Verzekerde 184"]
[null,null,"Verzekerde 185"]
[null,null,"Verzekerde 186"]
[null,null,"Verzekerde 187"]
[null,null,"Verzekerde 188"]
[null,null,"Verzekerde 189"]
[null,null,"Verzekerde 190"]
[null,null,"Verzekerde 191"]
[null,null,"Verzekerde 192"]
[null,null,"Verzekerde 193"]
[null,null,"Verzekerde 194"]
[null,null,"Verzekerde 195"]
[null,null,"Verzekerde 196"]
[null,null,"Verzekerde 197"]
[null,null,"Verzekerde 198"]
[null,null,"Verzekerde 199"]
[null,null,"Verzekerde 200"]
[null,null,"Verzekerde 201"]
[null,null,"Verzekerde 202"]
[null,null,"Verzekerde 203"]
[null,null,"Verzekerde 204"]
[null,null,"Verzekerde 205"]
[null,null,"Verzekerde 206"]
[null,null,"Verzekerde 207"]
[null,null,"Verzekerde 208"]
[null,null,"Verzekerde 209"]
[null,null,"Verzekerde 210"]
[null,null,"Verzekerde 211"]
[null,null,"Verzekerde 212"]
[null,null,"Verzekerde 213"]
[null,null,"Verzekerde 214"]
[null,null,"Verzekerde 215"]
[null,null,"Verzekerde 216"]
[null,null,"Verzekerde 217"]
[null,null,"Verzekerde 218"]
[null,null,"Verzekerde 219"]
[null,null,"Verzekerde 220"]
[null,null,"Verzekerde 221"]
[null,null,"Verzekerde 222"]
[null,null,"Verzekerde 223"]
[null,null,"Verzekerde 224"]
[null,null,"Verzekerde 225"]
[null,null,"Verzekerde 226"]
[null,null,"Verzekerde 227"]
[null,null,"Verzekerde 228"]
[null,null,"Verzekerde 229"]
[null,null,"Verzekerde 230"]
[null,null,"Verzekerde 231"]
[null,null,"Verzekerde 232"]
[null,null,"Verzekerde 233"]
[null,null,"Verzekerde 234"]
[null,null,"Verzekerde 235"]
[null,null,"Verzekerde 236"]
[null,null,"Verzekerde 237"]
[null,null,"Verzekerde 238"]
[null,null,"Verzekerde 239"]
[null,null,"Verzekerde 240"]
[null,null,"Verzekerde 241"]
[null,null,"Verzekerde 242"]
[null,null,"Verzekerde 243"]
[null,null,"Verzekerde 244"]
[null,null,"Verzekerde 245"]
[null,null,"Verzekerde 246"]
[null,null,"Verzekerde 247"]
[null,null,"Verzekerde 248"]
[null,null,"Verzekerde 249"]
[null,null,"Verzekerde 250"]
[null,null,"Verzekerde 251"]
[null,null,"Verzekerde 252"]
[null,null,"Verzekerde 253"]
[null,null,"Verzekerde 254"]
[null,null,"Verzekerde 255"]
[null,null,"Verzekerde 256"]
[null,null,"Verzekerde 257"]
[null,null,"Verzekerde 258"]
[null,null,"Verzekerde 259"]
[null,null,"Verzekerde 260"]
[null,null,"Verzekerde 261"]
[null,null,"Verzekerde 262"]
[null,null,"Verzekerde 263"]
[null,null,"Verzekerde 264"]
[null,null,"Verzekerde 265"]
[null,null,"Verzekerde 266"]
[null,null,"Verzekerde 267"]
[null,null,"Verzekerde 268"]
[null,null,"Verzekerde 269"]
[null,null,"Verzekerde 270"]
[null,null,"Verzekerde 271"]
[null,null,"Verzekerde 272"]
[null,null,"Verzekerde 273"]
[null,null,"Verzekerde 274"]
[null,null,"Verzekerde 275"]
[null,null,"Verzekerde 276"]
[null,null,"Verzekerde 277"]
[null,null,"Verzekerde 278"]
[null,null,"Verzekerde 279"]
[null,null,"Verzekerde 280"]
[null,null,"Verzekerde 281"]
[null,null,"Verzekerde 282"]
[null,null,"Verzekerde 283"]
[null,null,"Verzekerde 284"]
[null,null,"Verzekerde 285"]
[null,null,"Verzekerde 286"]
[null,null,"Verzekerde 287"]
[null,null,"Verzekerde 288"]
[null,null,"Verzekerde 289"]
[null,null,"Verzekerde 290"]
[null,null,"Verzekerde 291"]
[null,null,"Verzekerde 292"]
[null,null,"Verzekerde 293"]
[null,null,"Verzekerde 294"]
[null,null,"Verzekerde 295"]
[null,null,"Verzekerde 296"]
[null,null,"Verzekerde 297"]
[null,null,"Verzekerde 298"]
[null,null,"Verzekerde 299"]
[null,null,"Verzekerde 300"]
[null,null,"Verzekerde 301"]
[null,null,"Verzekerde 302"]
[null,null,"Verzekerde 303"]
[null,null,"Verzekerde 304"]
[null,null,"Verzekerde 305"]
[null,null,"Verzekerde 306"]
[null,null,"Verzekerde 307"]
[null,null,"Verzekerde 308"]
[null,null,"Verzekerde 309"]
[null,null,"Verzekerde 310"]
[null,null,"Verzekerde 311"]
[null,null,"Verzekerde 312"]
[null,null,"Verzekerde 313"]
[null,null,"Verzekerde 314"]
[null,null,"Verzekerde 315"]
[null,null,"Verzekerde 316"]
[null,null,"Verzekerde 317"]
[null,null,"Verzekerde 318"]
[null,null,"Verzekerde 319"]
[null,null,"Verzekerde 320"]
[null,null,"Verzekerde 321"]
[null,null,"Verzekerde 322"]
[null,null,"Verzekerde 323"]
[null,null,"Verzekerde 324"]
[null,null,"Verzekerde 325"]
[null,null,"Verzekerde 326"]
[null,null,"Verzekerde 327"]
[null,null,"Verzekerde 328"]
[null,null,"Verzekerde 329"]
[null,null,"Verzekerde 330"]
[null,null,"Verzekerde 331"]
[null,null,"Verzekerde 332"]
[null,null,"Verzekerde 333"]
[null,null,"Verzekerde 334"]
[null,null,"Verzekerde 335"]
[null,null,"Verzekerde 336"]
[null,null,"Verzekerde 337"]
[null,null,"Verzekerde 338"]
[null,null,"Verzekerde 339"]
[null,null,"Verzekerde 340"]
[null,null,"Verzekerde 341"]
[null,null,"Verzekerde 342"]
[null,null,"Verzekerde 343"]
[null,null,"Verzekerde 344"]
[null,null,"Verzekerde 345"]
[null,null,"Verzekerde 346"]
[null,null,"Verzekerde 347"]
[null,null,"Verzekerde 348"]
[null,null,"Verzekerde 349"]
[null,null,"Verzekerde 350"]
[null,null,"Verzekerde 351"]
[null,null,"Verzekerde 352"]
[null,null,"Verzekerde 353"]
[null,null,"Verzekerde 354"]
[null,null,"Verzekerde 355"]
[null,null,"Verzekerde 356"]
[null,null,"Verzekerde 357"]
[null,null,"Verzekerde 358"]
[null,null,"Verzekerde 359"]
[null,null,"Verzekerde 360"]
[null,null,"Verzekerde 361"]
[null,null,"Verzekerde 362"]
[null,null,"Verzekerde 363"]
[null,null,"Verzekerde 364"]
[null,null,"Verzekerde 365"]
[null,null,"Verzekerde 366"]
[null,null,"Verzekerde 367"]
[null,null,"Verzekerde 368"]
[null,null,"Verzekerde 369"]
[null,null,"Verzekerde 370"]
[null,null,"Verzekerde 371"]
[null,null,"Verzekerde 372"]
[null,null,"Verzekerde 373"]
[null,null,"Verzekerde 374"]
[null,null,"Verzekerde 375"]
[null,null,"Verzekerde 376"]
[null,null,"Verzekerde 377"]
[null,null,"Verzekerde 378"]
[null,null,"Verzekerde 379"]
[null,null,"Verzekerde 380"]
[null,null,"Verzekerde 381"]
[null,null,"Verzekerde 382"]
[null,null,"Verzekerde 383"]
[null,null,"Verzekerde 384"]
[null,null,"Verzekerde 385"]
[null,null,"Verzekerde 386"]
[null,null,"Verzekerde 387"]
[null,null,"Verzekerde 388"]
{"$rows_left_out":1003}
{"sheet":"Parameters","index":4,"n_rows":23,"n_cols":4,"rows_kept":23,"cut":false,"hidden":true,"merged":[]}
[]
["NUMMER_ZK","NAAM_ZK","FORMAT_ZK1","PLAATS"]
["0000","KIES UW UZOVI-NUMMER",{"$f":"CONCATENATE(A3,\" \",B3)","v":"0000 KIES UW UZOVI-NUMMER"},"PLAATS"]
["0101","N.V. UNIVÉ ZORG","0101 N.V. UNIVÉ ZORG","ARNHEM"]
["0104","CENTRALE ZIEKTEKOSTENVERZEKERING NZV N.V.","0104 CENTRALE ZIEKTEKOSTENVERZEKERING NZV N.V.","TILBURG"]
["0201","OHRA ZIEKTEKOSTENVERZEKERINGEN N.V.","0201 OHRA ZIEKTEKOSTENVERZEKERINGEN N.V.","TILBURG"]
["0403","ASR BASIS ZIEKTEKOSTENVERZEKERINGEN N.V.","0403 ASR BASIS ZIEKTEKOSTENVERZEKERINGEN N.V.","UTRECHT"]
["0699","IZA ZORGVERZEKERAAR N.V.","0699 IZA ZORGVERZEKERAAR N.V.","ARNHEM"]
["0736","N.V. ZORGVERZEKERAAR UMC","0736 N.V. ZORGVERZEKERAAR UMC","ARNHEM"]
["3311","ZILVEREN KRUIS ZORGVERZEKERINGEN N.V.","3311 ZILVEREN KRUIS ZORGVERZEKERINGEN N.V.","HENGELO OV"]
["3313","INTERPOLIS ZORGVERZEKERINGEN N.V.","3313 INTERPOLIS ZORGVERZEKERINGEN N.V.","LEIDEN"]
["3332","MENZIS ZORGVERZEKERAAR N.V.",{"$f":"CONCATENATE(A12,\" \",B12)","v":"3332 MENZIS ZORGVERZEKERAAR N.V."},"WAGENINGEN"]
["3333","ANDERZORG N.V.",{"$f":"CONCATENATE(A13,\" \",B13)","v":"3333 ANDERZORG N.V."},"GRONINGEN"]
["3343","ONVZ ZIEKTEKOSTENVERZEKERAAR N.V.",{"$f":"CONCATENATE(A14,\" \",B14)","v":"3343 ONVZ ZIEKTEKOSTENVERZEKERAAR N.V."},"HOUTEN"]
["3347","SALLAND ZORGVERZEKERAAR N.V.","3347 SALLAND ZORGVERZEKERAAR N.V.","DEVENTER"]
["3351","FBTO ZORGVERZEKERINGEN N.V.",{"$f":"CONCATENATE(A16,\" \",B16)","v":"3351 FBTO ZORGVERZEKERINGEN N.V."},"LEEUWARDEN"]
["3358","DE FRIESLAND","3358 DE FRIESLAND","LEEUWARDEN"]
["3359","EUCARE INSURANCE PCC LTD","3359 EUCARE INSURANCE PCC LTD","TA' XBIEX"]
["7029","OWM ZORGVERZEKERAAR 'DSW' U.A.","7029 OWM ZORGVERZEKERAAR 'DSW' U.A.","SCHIEDAM"]
["7037","STAD HOLLAND ZORGVERZEKERAAR OWM U.A.","7037 STAD HOLLAND ZORGVERZEKERAAR OWM U.A.","SCHIEDAM"]
["7085","OWM ZORGVERZEKERAAR ZORG EN ZEKERHEID U.A.","7085 OWM ZORGVERZEKERAAR ZORG EN ZEKERHEID U.A.","LEIDEN"]
["7095","VGZ ZORGVERZEKERAAR N.V.","7095 VGZ ZORGVERZEKERAAR N.V.","ARNHEM"]
["7119","OWM CENTRALE ZORGVERZEKERAARS GROEP, ZORGVERZEKERAAR U.A.","7119 OWM CENTRALE ZORGVERZEKERAARS GROEP, ZORGVERZEKERAAR U.A.","TILBURG"]